{"text_format":"1","workbook":"xlsx","n_sheets":5,"sheets":["Instructions","Index","Price List","Websites","Changes"],"not_rendered":{"charts":0,"images":2,"macros":1,"external_links":0,"defined_names":18,"comments":0,"pivot_tables":0},"unopened":[],"bounds":{"document_bytes":16777216,"sheet_cells":100000,"rows_first":2000,"rows_last":500,"rows_between":2000,"halvings":0,"cell_chars":16384,"cell_head_chars":4096},"cells_cut":0,"cells_raw":0,"read":"whole","date_system":"1900"}

{"sheet":"Instructions","index":0,"n_rows":58,"n_cols":10,"rows_kept":58,"cut":false,"hidden":false,"merged":[[7,2,7,7],[36,3,36,4]]}
["Manufacturer","Cotto d'Este"]
["File as","C"]
["Product Code","D"]
["CCTD Effective Date","1/1/25 (Updated)"]
[]
[]
[]
["Enter your Company Name"]
[]
[null,"Click on \"Index\" to set the print area for the price list index"]
[null,"Then you can send it to print"]
[]
[]
[null,"Click on \"Suggested Price List\" to set the print area for Conestoga Tile's suggested price list."]
[null,"Then you can send it to print"]
[]
[]
[null,"Enter your discount codes if you want a personal net cost sheet."]
[]
[null,"Product"]
[null,"Code","Disc. %"]
[null,{"$f":"+B3","v":"D"}]
[]
[null,"Click on \"Your Cost\" to set the print area for your personal cost report."]
[null,"Then you can send it to print"]
[]
[]
["Discount: ","To help establish your price list, enter the gross profit percent for each type of product."]
[null,"If you want to use Conestoga Tile's list price, leave them blank."]
[]
["Round Nickel: ","If you always want your price to round to the nearest nickel, enter \"YES\"."]
[null,"If you enter \"NO\", it will NOT round to the nearest nickel."]
[]
["Ending Cents: ","If you always want your price to end with a certain cents, enter that cent value."]
[null,"If you leave it \"blank\" will NOT round to this cent value."]
[]
[null,"Group","GP Margin","GP Margin % for",null,"Round Nickel","add/subtract","Ending Cents"]
[null,1,null,"Field Tile",null,"No",0]
[null,2,null,"Trim",null,"No",0]
[null,3,null,"Decos",null,"No",0,null,null,"  "]
{"$rows_left_out":19}
{"sheet":"Index","index":1,"n_rows":51,"n_cols":11,"rows_kept":51,"cut":false,"hidden":false,"merged":[[5,0,5,10],[48,0,48,10],[50,0,50,10],[2,5,2,10],[3,4,3,7]]}
[]
[]
[null,null,null,null,null,{"$f":"\"File '\"&Instructions!B2&\"' - \"&Instructions!B1","v":"File 'C' - Cotto d'Este"}]
[]
[]
[{"$f":"\"Price List Index - \"&Instructions!B4","v":"Price List Index - 1/1/25 (Updated)"}]
[]
[]
[]
[]
["Page",null,"Series",null,"Product Type"]
[1,null,"Black-White",null,"Laminated Porcelain Stoneware"]
[1,null,"Cement Project",null,"Laminated Porcelain Stoneware"]
[1,null,"Grunge",null,"Laminated Porcelain Stoneware"]
[1,null,"Kerlite Easy",null,"Dry Installation System"]
[1,null,"Limestone",null,"Laminated Porcelain Stoneware"]
[1,null,"Lithos",null,"Laminated Porcelain Stoneware",null,null,null,null,null," "]
[1,null,"Metal",null,"Laminated Porcelain Stoneware"]
[1,null,"Pietra D'Iseo",null,"Laminated Porcelain Stoneware"]
["1-2",null,"Vanity",null,"Laminated Porcelain Stoneware"]
[2,null,"Wonderwall",null,"Laminated Porcelain Stoneware"]
[]
[]
[]
[]
[]
[]
[]
[]
[]
[]
[]
[]
[]
[]
[]
[]
[]
[]
[]
{"$rows_left_out":12}
{"sheet":"Price List","index":2,"n_rows":236,"n_cols":41,"rows_kept":236,"cut":false,"hidden":false,"merged":[[14,13,15,19],[13,30,13,32],[12,22,12,23],[12,14,12,19],[225,3,225,4],[18,2,18,19],[17,14,17,15],[221,2,221,19],[10,14,10,15],[9,14,9,19],[9,22,9,23],[9,25,9,32]]}
[null,"Field Tile",null,null,"Size",null,"Field",null,null,null,null,null,null,null,null,"SF/CTN",null,null,{"$f":"IF(Suggested=\"Yes\",AA1,AG1)","v":0.05},"SF",{"$f":"+Instructions!$B$3","v":"D"},null,{"$f":"+Instructions!$C$22","v":0},{"$f":"ROUND($AA1*(1-W1)+0.004999,2)","v":0.05},null,"new",0.05,{"$f":"+W1","v":0},0.05,{"$f":"(AG1-AC1)/AG1","v":0},null,1,{"$f":"SUM(AJ1:AL1)+AE1","v":0.05},null,null,{"$f":"ROUND(AC1/(1-VLOOKUP(AF1,Group,2,FALSE)),2)","v":0.05},{"$f":"IF(VLOOKUP(AF1,Group,5,FALSE)=\"YES\",VLOOKUP(ROUND(ROUND(AJ1,1)-AJ1,2),Round,2,FALSE)+VLOOKUP(AF1,Group,6,FALSE),0)","v":0},{"$f":"IF(VLOOKUP(AF1,Group,7,FALSE)=\"\",0,ROUND(AJ1-0.04999,1)-AJ1+AM1)","v":0},{"$f":"IF(VLOOKUP(AF1,Group,7,FALSE)=\"\",\"\",VLOOKUP(AF1,Group,7,FALSE))","v":""},null,"X"]
[null,"Trim",null,null,"Size",null,"Shape",null,"Description",null,null,null,null,null,null,null,null,null,{"$f":"IF(Suggested=\"Yes\",AA2,AG2)","v":0.05},"EA",{"$f":"+Instructions!$B$3","v":"D"},null,{"$f":"+Instructions!$C$22","v":0},0.05,null,"new",0.05,0,0.05,0,null,2,0.05,null,null,0.05,0,0,"",null,"X"]
[null,"Decos",null,null,"Size",null,"Shape",null,"Description",null,null,null,null,null,null,null,null,null,0.05,"EA",{"$f":"+Instructions!$B$3","v":"D"},null,{"$f":"+Instructions!$C$22","v":0},0.05,null,"new",0.05,0,0.05,0,null,3,0.05,null,null,0.05,0,0,"",null,"X"]
[null,"Italy",null,null,"Size",null,"Shape",null,"Description",null,null,null,null,null,null,null,null,null,0.05,"EA",{"$f":"+Instructions!$B$3","v":"D"},null,{"$f":"+Instructions!$C$22","v":0},0.05,null,"new",0.05,0,0.05,0,null,4,0.05,null,null,0.05,0,0,"",null,"X"]
[null,0,null,null,"Size",null,"Shape",null,"Description",null,null,null,null,null,null,null,null,null,{"$error":"#REF!"},"EA",{"$f":"+Instructions!$B$3","v":"D"},null,{"$f":"+Instructions!$C$22","v":0},{"$error":"#REF!"},null,"new",{"$error":"#REF!"},0,{"$error":"#REF!"},{"$error":"#REF!"},null,5,{"$error":"#REF!"},null,null,{"$error":"#REF!"},0,0,"",null,"X"]
[null,0,null,null,"Size",null,"Shape",null,"Description",null,null,null,null,null,null,null,null,null,{"$error":"#REF!"},"EA",{"$f":"+Instructions!$B$3","v":"D"},null,{"$f":"+Instructions!$C$22","v":0},{"$error":"#REF!"},null,"new",{"$error":"#REF!"},0,{"$error":"#REF!"},{"$error":"#REF!"},null,6,{"$error":"#REF!"},null,null,{"$error":"#REF!"},0,0,"",null,"X"]
[null,0,null,null,"Size",null,"Shape",null,"Description",null,null,null,null,null,null,null,null,null,{"$error":"#REF!"},"EA",{"$f":"+Instructions!$B$3","v":"D"},null,{"$f":"+Instructions!$C$22","v":0},{"$error":"#REF!"},null,"new",{"$error":"#REF!"},0,{"$error":"#REF!"},{"$error":"#REF!"},null,7,{"$error":"#REF!"},null,null,{"$error":"#REF!"},0,0,"",null,"X"]
[null,"Format",null,null,null,null,null,null,null,null,null,null,null,null,null,null,"Stock","a",1000,"ABC",null,null,0.1,1000,null,"ABC",1000,0.1,1000,0.1,10,null,1000,null,null,null,null,null,null,null,"X"]
[null,null,null,null,null,null,null,null,null,null,null,null,null,null,null,null,null,null,null,null,null,null,null,null,null,null,null,null,null,null,null,null,null,null,null,null,null,null,null,null,"X"]
[null,null,null,null,null,null,null,null,null,null,null,null,null,null,"Price List",null,null,null,null,null,null,null,"Cust. Cost",null,null,"Customer Cost Calculation",null,null,null,null,null,null,null,null,null,null,null,null,null,null,"X"]
[null,null,null,"Sizes & Shapes",null,null,null,null,null,null,null,null,null,null,"Full Carton",null,"Stock","Note",{"$f":"IF(Suggested=\"Yes\",AA11,AG11)","v":"List Price"},"U/M","Code",null,"Disc.","Net",null,"Chg","List Price","Disc","Act. Cost","GP%","Adj.","Group","Price",null,null,"Calc Price",".05 Round","Cents","Round to",null,"X"]
[null,null,null,null,null,null,null,null,null,null,null,null,null,null,null,null,null,null,null,null,null,null,null,null,null,null,null,null,null,null,null,null,null,null,null,null,null,null,null,null,"X"]
[null,null,null,null,null,null,null,null,null,null,null,null,null,null,{"$f":"\"File '\"&Instructions!B2&\"' - \"&Instructions!B1","v":"File 'C' - Cotto d'Este"},null,null,null,null,null,null,null,"Cost",null,null,null,null,null,null,null,null,null,"Retail Price Calculations",null,null,null,null,null,null,null,"X"]
[null,null,null,null,null,null,null,null,null,null,null,null,null,null,null,null,null,null,null,{"$f":"+Instructions!B4","v":"1/1/25 (Updated)"},null,null,null,null,null,null,null,null,null,null,{"$f":"TODAY()","v":"2025-01-14"},null,null,null,null,null,null,null,null,null,"X"]
[null,null,null,null,null,null,null,null,null,null,null,null,null,{"$f":"IF(Instructions!C8=\"\",\"\",+Instructions!C8)","v":""},null,null,null,null,null,null,null,null,null,null,null,null,null,null,null,null,null,null,null,null,null,null,null,null,null,null,"X"]
[null,null,{"$f":"\"Product Code '\"&Instructions!B3&\"'\"","v":"Product Code 'D'"},null,null,null,null,null,null," ","  ",null,null,null,null,null,null,null,null,null,null,null,null,null,null,null,null,null,null,null,null,null,{"$f":"IF(Instructions!$C$8=\"\",\"\",Instructions!$C$8)","v":""},null,null,null,null,null,null,null,"X"]
[null,null,null,null,null,null,null,null,null,null,null,null,null,null,null,null,null,null,null,null,null,null,null,null,null,null,null,null,null,null,null,null,null,null,null,null,null,null,null,null,"X"]
[null,null,"Sizes & Shapes",null,null,null,null,null,null,null,null,null,null,null,"Full Carton",null,"Stock","Note",{"$f":"+S$11","v":"List Price"},"U/M",{"$f":"+U$11","v":"Code"},null,"Disc.","Net",null,"Chg","List Price",{"$f":"+AB$11","v":"Disc"},"Act. Cost","GP%","Adj.",{"$f":"+AF$11","v":"Group"},"Price",null,null,"Calc Price",".05 Round","Cents","Round to",null,"X"]
[null,null,"ALL ITEMS MARKED WITH PACKAGING QUANTITY ARE SOLD IN MULTIPLES OF THAT QUANTITY ONLY",null,null,null,null,null,null,null,null,null,null,null,null,null,null,null,null,null,null,null,null,null,null,null,null,null,null,null,null,null,null,null,null,null,null,null,null,null,"X"]
[null,null,null,null,null,null,null,null,null,null,null,null,null," ",null,null,null,null,null,null,null,null,null,null,null,null,null,null,null,null,null,null,null,null,null,null,null,null,null,null,"X"]
[null,null,"BLACK-WHITE",null,null,null," ",null,null," ",null,null,null,null,null,null,null,"Item # Lookup:","CDBW",null,null,null,null,null,null,null,null,null,null,null,null,null,null,null,null,null,null,null,null,null,"X"]
[null,null,null,null,null,null,null,null,null,null,null,null,null,null,null,null,null,null,null,null,null,null,null,null,null,null,null,null,null,null,null,null,null,null,null,null,null,null,null,null,"X"]
[null,null,null,"Color:","Black",null,null,null,null,null,null,null,null,null,null,null,null,null,null,null,null,null,null,null,null,null,null,null,null,null,null,null,null,null,null,null,null,null,null,null,"X"]
[null,null,null,null,null,null,null,null,null,null,null,null,null,null,null,null,null,null,null,null,null,null,null,null,null,null,null,null,null,null,null,null,null,null,null,null,null,null,null,null,"X"]
[null,"Field Tile",null,null,"39\" x 118\" x 5.5mm",null,"Field / Kerlite",null,null,null,"Glossy / Rectified",null,null,null,null,"32.29 SF/SLAB",null,"a",{"$f":"IF(Suggested=\"Yes\",AA25,AG25)","v":28},"SF",{"$f":"+Instructions!$B$3","v":"D"},null,{"$f":"+Instructions!$C$22","v":0},{"$f":"ROUND($AA25*(1-W25)+0.004999,2)","v":28},null,"",28,{"$f":"+W25","v":0},28,{"$f":"(AG25-AC25)/AG25","v":0},null,1,{"$f":"SUM(AJ25:AL25)+AE25","v":28},null,null,{"$f":"ROUND(AC25/(1-VLOOKUP(AF25,Group,2,FALSE)),2)","v":28},{"$f":"IF(VLOOKUP(AF25,Group,5,FALSE)=\"YES\",VLOOKUP(ROUND(ROUND(AJ25,1)-AJ25,2),Round,2,FALSE)+VLOOKUP(AF25,Group,6,FALSE),0)","v":0},{"$f":"IF(VLOOKUP(AF25,Group,7,FALSE)=\"\",0,ROUND(AJ25-0.04999,1)-AJ25+AM25)","v":0},{"$f":"IF(VLOOKUP(AF25,Group,7,FALSE)=\"\",\"\",VLOOKUP(AF25,Group,7,FALSE))","v":""},null,"X"]
[null,null,null,null,null,null,null,null,null,null,null,null,null,null,null,null,null,null,null,null,null,null,null,null,null,null,null,null,null,null,null,null,null,null,null,null,null,null,null,null,"X"]
[null,"Field Tile",null,null,"39\" x 118\" x 5.5mm",null,"Field / Kerlite",null,null,null,"Silk / Rectified",null,null,null,null,"32.29 SF/SLAB",null,"a",{"$f":"IF(Suggested=\"Yes\",AA27,AG27)","v":22.1},"SF",{"$f":"+Instructions!$B$3","v":"D"},null,{"$f":"+Instructions!$C$22","v":0},{"$f":"ROUND($AA27*(1-W27)+0.004999,2)","v":22.1},null,"",22.1,{"$f":"+W27","v":0},22.1,{"$f":"(AG27-AC27)/AG27","v":0},null,1,{"$f":"SUM(AJ27:AL27)+AE27","v":22.1},null,null,{"$f":"ROUND(AC27/(1-VLOOKUP(AF27,Group,2,FALSE)),2)","v":22.1},{"$f":"IF(VLOOKUP(AF27,Group,5,FALSE)=\"YES\",VLOOKUP(ROUND(ROUND(AJ27,1)-AJ27,2),Round,2,FALSE)+VLOOKUP(AF27,Group,6,FALSE),0)","v":0},{"$f":"IF(VLOOKUP(AF27,Group,7,FALSE)=\"\",0,ROUND(AJ27-0.04999,1)-AJ27+AM27)","v":0},{"$f":"IF(VLOOKUP(AF27,Group,7,FALSE)=\"\",\"\",VLOOKUP(AF27,Group,7,FALSE))","v":""},null,"X"]
[null,null,null,null,null,null,null,null,null,null,null,null,null,null,null,null,null,null,null,null,null,null,null,null,null,null,null,null,null,null,null,null,null,null,null,null,null,null,null,null,"X"]
[null,null,null,"Color:","Ultrawhite",null,null,null,null,null,null,null,null,null,null,null,null,null,null,null,null,null,null,null,null,null,null,null,null,null,null,null,null,null,null,null,null,null,null,null,"X"]
[null,null,null,null,null,null,null,null,null,null,null,null,null,null,null,null,null,null,null,null,null,null,null,null,null,null,null,null,null,null,null,null,null,null,null,null,null,null,null,null,"X"]
[null,"Field Tile",null,null,"39\" x 39\" x 5.5mm",null,"Field / Kerlite",null,null,null,"Glossy / Rectified",null,null,null,null,"21.53 SF/CTN",null,null,{"$f":"IF(Suggested=\"Yes\",AA31,AG31)","v":30.65},"SF",{"$f":"+Instructions!$B$3","v":"D"},null,{"$f":"+Instructions!$C$22","v":0},{"$f":"ROUND($AA31*(1-W31)+0.004999,2)","v":30.65},null,"",30.65,{"$f":"+W31","v":0},30.65,{"$f":"(AG31-AC31)/AG31","v":0},null,1,{"$f":"SUM(AJ31:AL31)+AE31","v":30.65},null,null,{"$f":"ROUND(AC31/(1-VLOOKUP(AF31,Group,2,FALSE)),2)","v":30.65},{"$f":"IF(VLOOKUP(AF31,Group,5,FALSE)=\"YES\",VLOOKUP(ROUND(ROUND(AJ31,1)-AJ31,2),Round,2,FALSE)+VLOOKUP(AF31,Group,6,FALSE),0)","v":0},{"$f":"IF(VLOOKUP(AF31,Group,7,FALSE)=\"\",0,ROUND(AJ31-0.04999,1)-AJ31+AM31)","v":0},{"$f":"IF(VLOOKUP(AF31,Group,7,FALSE)=\"\",\"\",VLOOKUP(AF31,Group,7,FALSE))","v":""},null,"X"]
[null,"Field Tile",null,null,"39\" x 118\" x 5.5mm",null,"Field / Kerlite",null,null,null,"Glossy / Rectified",null,null,null,null,"32.29 SF/SLAB",null,"a",{"$f":"IF(Suggested=\"Yes\",AA32,AG32)","v":32.15},"SF",{"$f":"+Instructions!$B$3","v":"D"},null,{"$f":"+Instructions!$C$22","v":0},{"$f":"ROUND($AA32*(1-W32)+0.004999,2)","v":32.15},null,"",32.15,0,32.15,{"$f":"(AG32-AC32)/AG32","v":0},null,1,{"$f":"SUM(AJ32:AL32)+AE32","v":32.15},null,null,{"$f":"ROUND(AC32/(1-VLOOKUP(AF32,Group,2,FALSE)),2)","v":32.15},{"$f":"IF(VLOOKUP(AF32,Group,5,FALSE)=\"YES\",VLOOKUP(ROUND(ROUND(AJ32,1)-AJ32,2),Round,2,FALSE)+VLOOKUP(AF32,Group,6,FALSE),0)","v":0},{"$f":"IF(VLOOKUP(AF32,Group,7,FALSE)=\"\",0,ROUND(AJ32-0.04999,1)-AJ32+AM32)","v":0},{"$f":"IF(VLOOKUP(AF32,Group,7,FALSE)=\"\",\"\",VLOOKUP(AF32,Group,7,FALSE))","v":""},null,"X"]
[null,null,null,null,null,null,null,null,null,null,null,null,null,null,null,null,null,null,null,null,null,null,null,null,null,null,null,null,null,null,null,null,null,null,null,null,null,null,null,null,"X"]
[null,"Field Tile",null,null,"39\" x 118\" x 5.5mm",null,"Field / Kerlite",null,null,null,"Silk / Rectified",null,null,null,null,"32.29 SF/SLAB",null,"a",{"$f":"IF(Suggested=\"Yes\",AA34,AG34)","v":26.25},"SF",{"$f":"+Instructions!$B$3","v":"D"},null,{"$f":"+Instructions!$C$22","v":0},{"$f":"ROUND($AA34*(1-W34)+0.004999,2)","v":26.25},null,"",26.25,{"$f":"+W34","v":0},26.25,{"$f":"(AG34-AC34)/AG34","v":0},null,1,{"$f":"SUM(AJ34:AL34)+AE34","v":26.25},null,null,{"$f":"ROUND(AC34/(1-VLOOKUP(AF34,Group,2,FALSE)),2)","v":26.25},{"$f":"IF(VLOOKUP(AF34,Group,5,FALSE)=\"YES\",VLOOKUP(ROUND(ROUND(AJ34,1)-AJ34,2),Round,2,FALSE)+VLOOKUP(AF34,Group,6,FALSE),0)","v":0},{"$f":"IF(VLOOKUP(AF34,Group,7,FALSE)=\"\",0,ROUND(AJ34-0.04999,1)-AJ34+AM34)","v":0},{"$f":"IF(VLOOKUP(AF34,Group,7,FALSE)=\"\",\"\",VLOOKUP(AF34,Group,7,FALSE))","v":""},null,"X"]
[null,null,null,null,null,null,null,null,null,null,null,null,null,null,null,null,null,null,null,null,null,null,null,null,null,null,null,null,null,null,null,null,null,null,null,null,null,null,null,null,"X"]
[null,null,null,"Note:","a) There is an additional crate charge of $474.50 for each crate used for shipment.  There is 419.77 sf per crate.",null,null,null,null,null,null,null,null,null,null,null,null,null,null,null,null,null,null,null,null,null,null,null,null,null,null,null,null,null,null,null,null,null,null,null,"X"]
[null,null,null,null,null,null,null,null,null,null,null,null,null,null,null,null,null,null,null,null,null,null,null,null,null,null,null,null,null,null,null,null,null,null,null,null,null,null,null,null,"X"]
[null,null,"CEMENT PROJECT",null,null,null,null,null,null,null,null,null,null,null,null,null,null,"Item # Lookup:","CDCP",null,null,null,null,null,null,null,null,null,null,null,null,null,null,null,null,null,null,null,null,null,"X"]
[null,null,null,null,null,null,null,null,null,null,null,null,null,null,null,null,null,null,null,null,null,null,null,null,null,null,null,null,null,null,null,null,null,null,null,null,null,null,null,null,"X"]
[null,null,null,"Colors:","Color-10 Cem          Color-20 Cem          Color-30 Cem",null,null,null,null,null,null,null,null,null,null,null,null,null,null,null,null,null,null,null,null,null,null,null,null,null,null,null,null,null,null,null,null,null,null,null,"X"]
{"$rows_left_out":197}
{"sheet":"Websites","index":3,"n_rows":18,"n_cols":2,"rows_kept":18,"cut":false,"hidden":false,"merged":[]}
["Easy Access Website links"]
[]
["ConestogaTile's Website","http://www.conestogatile.com/"]
[]
["Manufacturer's Home Page","https://www.cottodeste.us/"]
[]
[]
["Product","Direct Website Link"]
["BLACK-WHITE","https://www.cottodeste.us/collection/black-white"]
["CEMENT PROJECT","https://www.cottodeste.us/collection/cement-project"]
["GRUNGE","https://www.cottodeste.us/collection/grunge"]
["KERLITE EASY","https://www.cottodeste.us/solutions/kerlite-easy"]
["LIMESTONE","https://www.cottodeste.us/collection/limestone"]
["LITHOS","https://www.cottodeste.us/collection/lithos"]
["METAL","https://www.cottodeste.us/collection/metal"]
["PIETRA D'ISEO","https://www.cottodeste.us/collection/pietra-d-iseo"]
["VANITY","https://www.cottodeste.us/collection/vanity"]
["WONDERWALL","https://www.cottodeste.us/collection/wonderwall"]

{"sheet":"Changes","index":4,"n_rows":122,"n_cols":11,"rows_kept":122,"cut":false,"hidden":false,"merged":[[5,0,17,0],[5,1,17,1]]}
["Date"]
["Announced","Series","Description"]
[]
["New Products"]
[]
["2024-12-01","Wonderwall","The following formats have been added: "]
[null,null,"39\" x 118\" x 3.5mm Blanc / Rectified Field Motif."]
[null,null,"19-1/2\" x 39\" x 3.5mm Botany A & B Motif."]
[null,null,"39\" x 118\" x 3.5mm Foliage A Motif."]
[null,null,"39\" x 118\" x 3.5mm Printemps A Motif."]
[null,null,"19-1/2\" x 39\" x 3.5mm Golden Leaf A&B Motif."]
[null,null,"39\" x 118\" x 3.5mm Golden Leaf A Motif."]
[null,null,"19-1/2\" x 39\" x 3.5mm Golden Slab Motif.",null,null,null,null,null,null,null,{"$f":"D13&\" \"&I13","v":" "}]
[null,null,"39\" x 118\" x 3.5mm Golden Slab Motif."]
[null,null,"19-1/2\" x 39\" x 3.5mm Silver Leaf A&B Motif."]
[null,null,"39\" x 118\" x 3.5mm Silver Leaf A Motif.",null,null,null,null,null,null,null," "]
[null,null,"19-1/2\" x 39\" x 3.5mm Silver Slab Motif."]
[null,null,"39\" x 118\" x 3.5mm Silver Slab Motif."]
["2025-01-14","Kerlite Easy","Kerlite Easy Mat Roll and Kerlite Easy Filler.",null,null,null,null,null,null,null," "]
[]
[]
[]
[]
[]
[]
[]
[]
[]
[]
[]
[]
[]
[]
[]
[]
[]
[]
[]
[]
[]
{"$rows_left_out":82}