{"text_format":"1","workbook":"xlsx","n_sheets":5,"sheets":["Instructions","Index","Price List","Websites","Changes"],"not_rendered":{"charts":0,"images":2,"macros":1,"external_links":0,"defined_names":19,"comments":0,"pivot_tables":0},"unopened":[],"bounds":{"document_bytes":16777216,"sheet_cells":100000,"rows_first":2000,"rows_last":500,"rows_between":2000,"halvings":0,"cell_chars":16384,"cell_head_chars":4096},"cells_cut":0,"cells_raw":0,"read":"whole","date_system":"1900"}

{"sheet":"Instructions","index":0,"n_rows":57,"n_cols":10,"rows_kept":57,"cut":false,"hidden":false,"merged":[[6,2,6,7],[35,3,35,4]]}
["Manufacturer","Florida Tile"]
["Product Code","G","File as:","F"]
["CCTD Effective Date","4/1/24 (Updated)"]
[]
[]
[]
["Enter your Company Name"]
[]
[null,"Click on \"Index\" to set the print area for the price list index"]
[null,"Then you can send it to print"]
[]
[]
[null,"Click on \"Suggested Price List\" to set the print area for Conestoga Tile's suggested price list."]
[null,"Then you can send it to print"]
[]
[]
[null,"Enter your discount codes if you want a personal net cost sheet."]
[]
[null,"Product"]
[null,"Code","Disc. %"]
[null,{"$f":"+B2","v":"G"}]
[]
[null,"Click on \"Your Cost\" to set the print area for your personal cost report."]
[null,"Then you can send it to print"]
[]
[]
["Discount: ","To help establish your price list, enter the gross profit percent for each type of product."]
[null,"If you want to use Conestoga Tile's list price, leave them blank."]
[]
["Round Nickel: ","If you always want your price to round to the nearest nickel, enter \"YES\"."]
{"$rows_left_out":28}
{"sheet":"Index","index":1,"n_rows":52,"n_cols":15,"rows_kept":52,"cut":false,"hidden":false,"merged":[[4,0,4,10],[47,0,47,10],[49,0,49,10],[51,0,51,10]]}
[]
[null,null,null,null,null,null,null,null,null,null,{"$f":"\"File '\"&Instructions!D2&\"' - \"&Instructions!B1","v":"File 'F' - Florida Tile"}]
[]
[null,null,null,null,null,null,null,null,null,null," "]
[{"$f":"\"Price List Index - \"&Instructions!B3","v":"Price List Index - 4/1/24 (Updated)"}]
[]
[]
[]
[]
["Page",null,"Series",null,"Product Type",null,"Page",null,"Series",null,"Product Type"]
[1,null,"Ainslee ParkHDP",null,"Ceramic & Porcelain ",null,6,null,"Memorable - Disc 12/6/24",null,"Unglazed Porcelain"]
[1,null,"AlustraHDP",null,"Color Body Porcelain",null,6,null,"MineralHDP",null,"2cm Porcelain Pavers"]
["1-2",null,"Amplify",null,"Glazed Ceramic",null,7,null,"NaturaHDP",null,"Color Body Porcelain"]
[2,null,"Aura",null,"Glazed Porcelain",null,7,null,"NY2LAHDP ",null,"Color Body Porcelain"]
[2,null,"Aventis",null,"Color Body Porcelain",null,7,null,"NY2LAHDP",null,"2cm Porcelain Pavers"]
[2,null,"Bellanova",null,"Color Body Porcelain",null,7,null,"PassengerHDP",null,"Color Body Porcelain"]
[2,null,"BerkshireHDP",null,"Color Body Porcelain",null,7,null,"PassengerHDP",null,"2cm Porcelain Pavers"]
[2,null,"BlueRunHDP",null,"Color Body Porcelain",null,7,null,"Pietra Art Bliss",null,"Natural Stone & Glass"]
[2,null,"BlueRunHDP",null,"2cm Porcelain Pavers",null,8,null,"Pietra Art Ledgerstone-Disc 8/21/24",null,"Natural Stone",null,null," "]
[3,null,"Canal StreetHDP",null,"Color Body Porcelain",null,8,null,"Pietra Art Pebbles",null,"Natural Stone"]
[3,null,"CellarHDP",null,"Color Body Porcelain",null,"8-9",null,"PreciousHDP",null,"Ceramic & Porcelain "]
[3,null,"Comfort",null,"Glazed Porcelain",null,9,null,"Rhyme",null,"Color Body Porcelain"]
[3,null,"ContinentDP",null,"Glazed Porcelain",null,9,null,"SequenceHDP",null,"Color Body Porcelain"]
[3,null,"CraftsmanDP - Disc 8/21/24",null,"Glazed Porcelain",null,9,null,"SerendipityHDP",null,"Color Body Porcelain"]
[3,null,"DivinityHDP",null,"Color Body Porcelain",null,9,null,"Soho",null,"Ceramic Wall"]
["3-4",null,"East VillageHDP",null,"Color Body Porcelain",null,"9-10",null,"Soho",null,"Porcelain Mosaics"]
[4,null,"Emotive",null,"Glazed Ceramic",null,10,null,"Songbird",null,"Glazed Ceramic"]
[4,null,"EnchantHDP",null,"Glazed Porcelain",null,10,null,"SpanHDP",null,"2cm Porcelain Pavers"]
[5,null,"ExcursionHDP",null,"Glazed Porcelain",null,10,null,"Storied",null,"Glazed Ceramic"]
[5,null,"Fluent",null,"Glazed Ceramic",null,"10-11",null,"Tempo",null,"Ceramic & Porcelain "]
{"$rows_left_out":23}
{"sheet":"Price List","index":2,"n_rows":1047,"n_cols":40,"rows_kept":1047,"cut":false,"hidden":false,"merged":[[9,14,9,19],[1036,3,1036,4],[18,2,18,19],[17,14,17,15],[12,14,12,19],[14,13,15,19],[10,14,10,15],[1033,2,1033,19],[1031,2,1031,19],[13,30,13,32],[9,25,9,32],[12,22,12,23],[9,22,9,23]]}
[null,"Field Tile",null,null,"Size",null,"Field",null,null,null,null,null,null,null,null,"SF/CTN",null,null,{"$f":"IF(Suggested=\"Yes\",AA1,AG1)","v":0.05},"SF",{"$f":"+Instructions!$B$21","v":"G"},null,{"$f":"+Instructions!$C$21","v":0},{"$f":"IF(Instructions!$C$21=\"Group\",#REF!,IF(Instructions!$C$21=\"Carter\",#REF!,ROUNDUP($AA1*(1-W1),2)))","v":0.05},null,"new",0.05,{"$f":"+W1","v":0},0.05,{"$f":"(AG1-AC1)/AG1","v":0},null,1,{"$f":"SUM(AI1:AK1)+AE1","v":0.05},null,{"$f":"ROUND(AC1/(1-VLOOKUP(AF1,Group,2,FALSE)),2)","v":0.05},{"$f":"IF(VLOOKUP(AF1,Group,5,FALSE)=\"YES\",VLOOKUP(ROUND(ROUND(AI1,1)-AI1,2),Round,2,FALSE)+VLOOKUP(AF1,Group,6,FALSE),0)","v":0},{"$f":"IF(VLOOKUP(AF1,Group,7,FALSE)=\"\",0,ROUND(AI1-0.04999,1)-AI1+AL1)","v":0},{"$f":"IF(VLOOKUP(AF1,Group,7,FALSE)=\"\",\"\",VLOOKUP(AF1,Group,7,FALSE))","v":""},null,"X"]
[null,"Trim",null,null,"Size",null,"Shape",null,"Description",null,null,null,null,null,null,null,null,null,0.05,"EA",{"$f":"+Instructions!$B$21","v":"G"},null,{"$f":"+Instructions!$C$21","v":0},{"$f":"IF(Instructions!$C$21=\"Group\",#REF!,IF(Instructions!$C$21=\"Carter\",#REF!,ROUNDUP($AA2*(1-W2),2)))","v":0.05},null,"new",0.05,0,0.05,0,null,2,0.05,null,0.05,0,0,"",null,"X"]
[null,"Decos",null,null,"Size",null,"Shape",null,"Description",null,null,null,null,null,null,null,null,null,0.05,"EA",{"$f":"+Instructions!$B$21","v":"G"},null,{"$f":"+Instructions!$C$21","v":0},{"$f":"IF(Instructions!$C$21=\"Group\",#REF!,IF(Instructions!$C$21=\"Carter\",#REF!,ROUNDUP($AA3*(1-W3),2)))","v":0.05},null,"new",0.05,0,0.05,0,null,3,0.05,null,0.05,0,0,"",null,"X"]
[null,"Builder - Field Tile",null,null,"Size",null,"Shape",null,"Description",null,null,null,null,null,null,"SF/CTN",null,null,0.05,"SF","xx",null,{"$f":"IF(Instructions!$C$21=\"Group\",\"Group\",IF(Instructions!$C$21=\"Carter\",\"Carter\",50%))","v":0.5},{"$f":"IF(Instructions!$C$21=\"Group\",#REF!,IF(Instructions!$C$21=\"Carter\",#REF!,ROUNDUP($AA4*(1-W4),2)))","v":0.03},null,"new",0.05,0.5,0.03,0,null,4,0.03,null,0.03,0,0,"",null,"X"]
[null,"Builder - Trim",null,null,"Size",null,"Shape",null,"Description",null,null,null,null,null,null,null,null,null,0.05,"EA","xx",null,{"$f":"IF(Instructions!$C$21=\"Group\",\"Group\",IF(Instructions!$C$21=\"Carter\",\"Carter\",50%))","v":0.5},{"$f":"IF(Instructions!$C$21=\"Group\",#REF!,IF(Instructions!$C$21=\"Carter\",#REF!,ROUNDUP($AA5*(1-W5),2)))","v":0.03},null,"new",0.05,0.5,0.03,0,null,5,0.03,null,0.03,0,0,"",null,"X"]
[null,"Builder - Decos",null,null,"Size",null,"Shape",null,"Description",null,null,null,null,null,null,null,null,null,0.05,"EA","xx",null,{"$f":"IF(Instructions!$C$21=\"Group\",\"Group\",IF(Instructions!$C$21=\"Carter\",\"Carter\",50%))","v":0.5},{"$f":"IF(Instructions!$C$21=\"Group\",#REF!,IF(Instructions!$C$21=\"Carter\",#REF!,ROUNDUP($AA6*(1-W6),2)))","v":0.03},null,"new",0.05,0.5,0.03,0,null,6,0.03,null,0.03,0,0,"",null,"X"]
[null,0,null,null,"Size",null,"Shape",null,"Description",null,null,null,null,null,null,null,null,null,{"$f":"IF(Suggested=\"Yes\",'Price List'!AA7,'Price List'!AG7)","v":0},"EA","G",null,{"$f":"+Instructions!$C$21","v":0},{"$f":"IF(Instructions!$C$21=\"Group\",#REF!,ROUND($AA7*(1-W7)+0.004999,2))","v":0},null,"new",0,0,0,{"$error":"#DIV/0!"},null,7,0,null,0,0,0,"",null,"X"]
[null,"Format",null,null,null,null,null,null,null,null,null,null,null,null,null,null,"Stock","a",1000,"ABC",null,null,0.1,1000,null,"ABC",1000,0.1,1000,0.1,10,null,1000,null,null,null,null,null,null,"X"]
[null,null,null,null,null,null,null,null,null,null,null,null,null,null,null,null,null,null,null,null,null,null,null,null,null,null,null,null,null,null,null,null,null,null,null,null,null,null,null,"X"]
[null,null,null,null,null,null,null,null,null,null,null,null,null,null,"Price List",null,null,null,null,null,null,null,"Cust. Cost",null,null,"Customer Cost Calculation",null,null,null,null,null,null,null,null,null,null,null,null,null,"X"]
[null,null,null,"Sizes & Shapes",null,null,null,null,null,null,null,null,null,null,"Full Carton",null,"Stock","Note",{"$f":"IF(Suggested=\"Yes\",AA11,AG11)","v":"List Price"},"U/M","Code",null,"Disc.","Net",null,"Chg","List Price","Disc","Act. Cost","GP%","Adj.","Group","Price",null,"Calc Price",".05 Round","Cents","Round to",null,"X"]
[null,null,null,null,null,null,null,null,null,null,null,null,null,null,null,null,null,null,null,null,null,null,null,null,null,null,null,null,null,null,null,null,null,null,null,null,null,null,null,"X"]
[null,null,null,null,null,null,null,null,null,null,null,null,null,null,{"$f":"\"File '\"&Instructions!D2&\"' - \"&Instructions!B1","v":"File 'F' - Florida Tile"},null,null,null,null,null,null,null,"Cost",null,null,null,null,null,null,null,null,null,"Retail Price Calculations",null,null,null,null,null,null,"X"]
[null,null,null,null,null,null,null,null,null,null,null,null,null,null,null,null,null,null,null,{"$f":"+Instructions!B3","v":"4/1/24 (Updated)"},null,null,null,null,null,null,null,null,null,null,{"$f":"TODAY()","v":"2024-12-06"},null,null,null,null,null,null,null,null,"X"]
[null,null,null,null,null,null,null,null,null,null,null,null,null,{"$f":"IF(Instructions!C7=\"\",\"\",+Instructions!C7)","v":""},null,null,null,null,null,null,null,null,null,null,null,null,null,null,null,null,null,null,null,null,null,null,null,null,null,"X"]
[null,null,{"$f":"\"Product Code '\"&Instructions!B2&\"'\"","v":"Product Code 'G'"},null,null,null,null,null,null,null,null,null,null,null,null,null,null,null,null,null,null,null,null,null,null,null,null,null,null,null,null,null,{"$f":"IF(Instructions!$C$7=\"\",\"\",Instructions!$C$7)","v":""},null,null,null,null,null,null,"X"]
[null,null,null,null,null,null,null,null,null,null,null,null,null,null,null,null,null,null,null,null,null,null,null,null,null,null,null,null,null,null,null,null,null,null,null,null,null,null,null,"X"]
[null,null,"Sizes & Shapes",null,null,null,null,null,null,null,null,null,null,null,"Full Carton",null,"Stock","Note",{"$f":"+S$11","v":"List Price"},"U/M",{"$f":"+U$11","v":"Code"},null,"Disc.","Net",null,"Chg","List Price",{"$f":"+AB$11","v":"Disc"},"Act. Cost","GP%","Adj.",{"$f":"+AF$11","v":"Group"},"Price",null,"Calc Price",".05 Round","Cents","Round to",null,"X"]
[null,null,"ALL ITEMS MARKED WITH PACKAGING QUANTITY ARE SOLD IN MULTIPLES OF THAT QUANTITY ONLY",null,null,null,null,null,null,null,null,null,null,null,null,null,null,null,null,null,null,null,null,null,null,null,null,null,null,null,null,null,null,null,null,null,null,null,null,"X"]
[null,null,null,null,null,null,null,null,null,null,null,null," ",null,null,null,null,null,null,null,null,null,null,null,null,null,null,null,null,null,null,null,null,null,null,null,null,null,null,"X"]
[null,null,"AINSLEE PARKHDP - Glazed Porcelain Floor & Ceramic Wall",null,null,null,null,null,null,null,null,null,null,null,null,null,null,"Item # Lookup:","FTAIN",null,null,null,null,null,null,null,null,null,null,null,null,null,null,null,null," ",null,null,null,"X"]
[null,null,null,null,null,null,null,null,null,null,null,null,null,null,null,null,null,null,null,null,null,null,null,null,null,null,null,null,null,null,null,null,null,null,null,null,null,null,null,"X"]
[null,null,null,"Colors:","AIN10 Calacatta Gold",null,null,null,"AIN30 Zebrino Taupe",null,null," "," ",null," ",null,null,null,null,null,null,null,null,null,null,null,null,null,null,null,null,null,null,null,null," ",null,null,null,"X"]
[null,null,null,null,"AIN20 Emperador Beige",null,null,null,"AIN40 Breccia Mist",null,null," ",null,null,null,null,null,null,null,null,null,null,null,null,null,null,null,null,null,null,null,null,null,null,null," ",null,null,null,"X"]
[]
[null,"Field Tile",null,"Floor:","3.75\" x 12\"",null,"Field",null,"Rectified",null,null,null,null,null,null,"6.12 SF/CTN",null,null,{"$f":"IF(Suggested=\"Yes\",AA26,AG26)","v":14.85},"SF",{"$f":"+Instructions!$B$21","v":"G"},null,{"$f":"+Instructions!$C$21","v":0},{"$f":"IF(Instructions!$C$21=\"Group\",#REF!,IF(Instructions!$C$21=\"Carter\",#REF!,ROUNDUP($AA26*(1-W26),2)))","v":14.85},null,"",14.85,{"$f":"+W26","v":0},14.85,{"$f":"(AG26-AC26)/AG26","v":0},null,1,{"$f":"SUM(AI26:AK26)+AE26","v":14.85},null,{"$f":"ROUND(AC26/(1-VLOOKUP(AF26,Group,2,FALSE)),2)","v":14.85},{"$f":"IF(VLOOKUP(AF26,Group,5,FALSE)=\"YES\",VLOOKUP(ROUND(ROUND(AI26,1)-AI26,2),Round,2,FALSE)+VLOOKUP(AF26,Group,6,FALSE),0)","v":0},{"$f":"IF(VLOOKUP(AF26,Group,7,FALSE)=\"\",0,ROUND(AI26-0.04999,1)-AI26+AL26)","v":0},{"$f":"IF(VLOOKUP(AF26,Group,7,FALSE)=\"\",\"\",VLOOKUP(AF26,Group,7,FALSE))","v":""},null,"X"]
[null,"Field Tile",null,null,"12\" x 12\"",null,"Field",null,null,null," ",null,null,null,null,"16.00 SF/CTN","Stock","a",{"$f":"IF(Suggested=\"Yes\",AA27,AG27)","v":5.3},"SF",{"$f":"+Instructions!$B$21","v":"G"},null,{"$f":"+Instructions!$C$21","v":0},{"$f":"IF(Instructions!$C$21=\"Group\",#REF!,IF(Instructions!$C$21=\"Carter\",#REF!,ROUNDUP($AA27*(1-W27),2)))","v":5.3},null,"",5.3,0,5.3,{"$f":"(AG27-AC27)/AG27","v":0},null,1,{"$f":"SUM(AI27:AK27)+AE27","v":5.3},null,{"$f":"ROUND(AC27/(1-VLOOKUP(AF27,Group,2,FALSE)),2)","v":5.3},{"$f":"IF(VLOOKUP(AF27,Group,5,FALSE)=\"YES\",VLOOKUP(ROUND(ROUND(AI27,1)-AI27,2),Round,2,FALSE)+VLOOKUP(AF27,Group,6,FALSE),0)","v":0},{"$f":"IF(VLOOKUP(AF27,Group,7,FALSE)=\"\",0,ROUND(AI27-0.04999,1)-AI27+AL27)","v":0},{"$f":"IF(VLOOKUP(AF27,Group,7,FALSE)=\"\",\"\",VLOOKUP(AF27,Group,7,FALSE))","v":""},null,"X"]
[null,"Field Tile",null,null,"12\" x 24\"",null,"Field",null,null,null,null,null,null,null,null,"15.30 SF/CTN","Stock","a",{"$f":"IF(Suggested=\"Yes\",AA28,AG28)","v":4.95},"SF",{"$f":"+Instructions!$B$21","v":"G"},null,{"$f":"+Instructions!$C$21","v":0},{"$f":"IF(Instructions!$C$21=\"Group\",#REF!,IF(Instructions!$C$21=\"Carter\",#REF!,ROUNDUP($AA28*(1-W28),2)))","v":4.95},null,"",4.95,0,4.95,{"$f":"(AG28-AC28)/AG28","v":0},null,1,{"$f":"SUM(AI28:AK28)+AE28","v":4.95},null,{"$f":"ROUND(AC28/(1-VLOOKUP(AF28,Group,2,FALSE)),2)","v":4.95},{"$f":"IF(VLOOKUP(AF28,Group,5,FALSE)=\"YES\",VLOOKUP(ROUND(ROUND(AI28,1)-AI28,2),Round,2,FALSE)+VLOOKUP(AF28,Group,6,FALSE),0)","v":0},{"$f":"IF(VLOOKUP(AF28,Group,7,FALSE)=\"\",0,ROUND(AI28-0.04999,1)-AI28+AL28)","v":0},{"$f":"IF(VLOOKUP(AF28,Group,7,FALSE)=\"\",\"\",VLOOKUP(AF28,Group,7,FALSE))","v":""},null,"X"]
[]
[null,"Decos",null,null,"12\" x 12\"",null,"M1x6STK",null,"Mosaic 1\" x 6\" Stack - AIN30 Zebrino Taupe",null,null,null,null,null,null,"5 EA/CTN",null,null,{"$f":"IF(Suggested=\"Yes\",AA30,AG30)","v":24.95},"EA",{"$f":"+Instructions!$B$21","v":"G"},null,{"$f":"+Instructions!$C$21","v":0},{"$f":"IF(Instructions!$C$21=\"Group\",#REF!,IF(Instructions!$C$21=\"Carter\",#REF!,ROUNDUP($AA30*(1-W30),2)))","v":24.95},null,"",24.95,{"$f":"+W30","v":0},24.95,{"$f":"(AG30-AC30)/AG30","v":0},null,3,{"$f":"SUM(AI30:AK30)+AE30","v":24.95},null,{"$f":"ROUND(AC30/(1-VLOOKUP(AF30,Group,2,FALSE)),2)","v":24.95},{"$f":"IF(VLOOKUP(AF30,Group,5,FALSE)=\"YES\",VLOOKUP(ROUND(ROUND(AI30,1)-AI30,2),Round,2,FALSE)+VLOOKUP(AF30,Group,6,FALSE),0)","v":0},{"$f":"IF(VLOOKUP(AF30,Group,7,FALSE)=\"\",0,ROUND(AI30-0.04999,1)-AI30+AL30)","v":0},{"$f":"IF(VLOOKUP(AF30,Group,7,FALSE)=\"\",\"\",VLOOKUP(AF30,Group,7,FALSE))","v":""},null,"X"]
{"$rows_left_out":1018}
{"sheet":"Websites","index":3,"n_rows":54,"n_cols":10,"rows_kept":54,"cut":false,"hidden":false,"merged":[]}
["Easy Access Website links"]
[null,null,null," "]
["ConestogaTile's Website","www.conestogatile.com"]
[null,null,null,null,null,null,null,null,null," "]
["Manufacturer's Home Page","www.floridatile.com"]
[]
[]
["Product","Direct Website Link"]
["Ainslee ParkHDP","http://www.floridatile.com/products/ainslee-park"]
["AlustraHDP","https://www.floridatile.com/products/alustra/"]
["Amplify","https://www.floridatile.com/products/amplify/"]
["Aura","https://www.floridatile.com/products/aura/"]
["Aventis","http://www.floridatile.com/products/aventis"]
["Bellanova","https://www.floridatile.com/products/bellanova/"]
["BerkshireHDP","http://www.floridatile.com/products/berkshire"]
["BlueRunHDP","https://www.floridatile.com/products/bluerun/"]
["Canal StreetHDP","https://www.floridatile.com/products/canalstreet/"]
["CellarHDP","http://www.floridatile.com/products/cellar"]
["Comfort","https://www.floridatile.com/products/comfort/"]
["ContinentDP","http://www.floridatile.com/products/continent"]
["CraftsmanDP","http://www.floridatile.com/products/craftsman"]
["DivinityHDP","http://www.floridatile.com/products/divinity"]
["East VillageHDP","https://www.floridatile.com/products/east-village/"]
["Emotive","https://www.floridatile.com/products/emotive/"]
["EnchantHDP","https://www.floridatile.com/products/enchant/"]
["ExcursionHDP","https://www.floridatile.com/products/excursion/"]
["Fluent","https://www.floridatile.com/products/fluent/"]
["GravitateHDP","https://www.floridatile.com/products/gravitate/"]
["High RidgeHDP","https://www.floridatile.com/products/highridge/"]
["Indulge","https://www.floridatile.com/products/indulge/"]
{"$rows_left_out":25}
{"sheet":"Changes","index":4,"n_rows":648,"n_cols":3,"rows_kept":648,"cut":false,"hidden":false,"merged":[[0,2,1,2]]}
["Date",null,"Description"]
["Announced","Series"]
["New Products"]
["2006-02-27","Retroclassic","S4369 & SN4369"]
["2006-03-01","Hamlet Manor"]
["2006-03-01","Horizon"]
["2006-03-01","Pinecrest"]
["2006-06-06","Stonehenge"]
["2006-04-17","Livingston"]
["2006-04-27","Scottish"]
["2006-04-27","Pietra Art Chiseled Edge Travertine"]
["2006-04-27","Pietra Art Mosaics"]
["2006-05-15","Hamlet Wall Tile"]
["2006-05-15","Terrace"]
["2006-05-24","Las Olas","added 13\"x13\", P43D9"]
["2006-08-10","Cotto"]
["2008-01-01","Urbanite","Throughbody Porcelain"]
["2008-01-01","Phoenix"]
["2008-12-01","Ashton"]
["2008-12-01","Cast Stone Fixtures"]
["2008-12-01","Millenia","Glazed Porcelain"]
["2008-12-01","Pietra Art Granite & Marble","GM024 - Teos Green & GM025 - Emperador Light colors in 12\"x12\" added."]
["2008-12-01","Pietra Art Mexican Travertine Planks"]
["2008-12-01","Pietra Art Tumbled Marble"]
["2009-04-01","Renaissance","Glazed Porcelain Floor Satin Finish & Glazed Ceramic Wall Gloss Finish"]
["2009-04-01","Progetto Casa","Throughbody Porcelain"]
["2009-04-01","Savannah","Glazed Porcelain floor & Ceramic wall"]
["2009-04-01","Soul","Glazed Porcelain"]
["2009-04-01","Taconic Slate","Glazed Porcelain "]
["2009-05-21","Metal Art Signature","Cast Metal Decorative Accents"]
{"$rows_left_out":618}