{"text_format":"1","workbook":"xlsx","n_sheets":5,"sheets":["Instructions","Index","Price List","Websites","Changes"],"not_rendered":{"charts":0,"images":2,"macros":1,"external_links":0,"defined_names":18,"comments":0,"pivot_tables":0},"unopened":[],"bounds":{"document_bytes":16777216,"sheet_cells":100000,"rows_first":2000,"rows_last":500,"rows_between":2000,"halvings":0,"cell_chars":16384,"cell_head_chars":4096},"cells_cut":0,"cells_raw":0,"read":"whole","date_system":"1900"}

{"sheet":"Instructions","index":0,"n_rows":58,"n_cols":11,"rows_kept":58,"cut":false,"hidden":false,"merged":[[7,2,7,7],[36,3,36,4]]}
["Manufacturer","Novabell"]
["File as","N"]
["Product Code","B"]
["CCTD Effective Date","11/1/24 (Updated)"]
[]
[]
[]
["Enter your Company Name"]
[]
[null,"Click on \"Index\" to set the print area for the price list index"]
[null,"Then you can send it to print"]
[]
[]
[null,"Click on \"Suggested Price List\" to set the print area for Conestoga Tile's suggested price list."]
[null,"Then you can send it to print"]
[]
[]
[null,"Enter your discount codes if you want a personal net cost sheet."]
[]
[null,"Product"]
[null,"Code","Disc. %"]
[null,{"$f":"+B3","v":"B"}]
[]
[null,"Click on \"Your Cost\" to set the print area for your personal cost report."]
[null,"Then you can send it to print"]
[]
[]
["Discount: ","To help establish your price list, enter the gross profit percent for each type of product."]
[null,"If you want to use Conestoga Tile's list price, leave them blank."]
[]
["Round Nickel: ","If you always want your price to round to the nearest nickel, enter \"YES\"."]
[null,"If you enter \"NO\", it will NOT round to the nearest nickel."]
[]
["Ending Cents: ","If you always want your price to end with a certain cents, enter that cent value."]
[null,"If you leave it \"blank\" will NOT round to this cent value."]
[]
[null,"Group","GP Margin","GP Margin % for",null,"Round Nickel","add/subtract","Ending Cents"]
[null,1,null,"Field Tile",null,"No",0,null,null," "]
[null,2,null,"Trim",null,"No",0]
[null,3,null,"Decos",null,"No",0]
{"$rows_left_out":19}
{"sheet":"Index","index":1,"n_rows":51,"n_cols":11,"rows_kept":51,"cut":false,"hidden":false,"merged":[[5,0,5,10],[48,0,48,10],[50,0,50,10],[2,5,2,10],[3,4,3,7]]}
[]
[]
[null,null,null,null,null,{"$f":"\"File '\"&Instructions!B2&\"' - \"&Instructions!B1","v":"File 'N' - Novabell"}]
[]
[]
[{"$f":"\"Price List Index - \"&Instructions!B4","v":"Price List Index - 11/1/24 (Updated)"}]
[]
[]
[]
[]
["Page",null,"Series",null,"Product Type",null,"Page",null,"Series",null,"Product Type"]
[1,null,"Aspen",null,"Glazed Porcelain"]
[1,null,"Brickup",null,"Glazed Porcelain"]
[1,null,"Extra",null,"Glazed Porcelain"]
[2,null,"Michelangelo (Disc. 10/23/24)",null,"Glazed Porcelain"]
[2,null,"Sovereign",null,"Glazed Porcelain"]
[2,null,"Urbe",null,"Glazed Porcelain"]
[]
[]
[]
[]
[]
[]
[]
[]
[]
[]
[]
[]
[]
[]
[]
[]
[]
[]
[]
[]
[]
[]
[]
{"$rows_left_out":12}
{"sheet":"Price List","index":2,"n_rows":195,"n_cols":41,"rows_kept":195,"cut":false,"hidden":false,"merged":[[14,13,15,19],[10,14,10,15],[9,14,9,19],[180,2,180,19],[184,3,184,4],[18,2,18,19],[17,14,17,15],[19,2,19,19],[178,2,178,19],[9,25,9,32],[12,22,12,23],[9,22,9,23],[13,30,13,32],[12,14,12,19]]}
[null,"Field Tile",null,null,"Size",null,"Field",null,null,null,null,null,null,null,null,"SF/CTN",null,null,{"$f":"IF(Suggested=\"Yes\",'Price List'!AA1,'Price List'!AG1)","v":0.05},"SF",{"$f":"+Instructions!$B$3","v":"B"},null,{"$f":"+Instructions!$C$22","v":0},{"$f":"ROUND($AA1*(1-W1)+0.004999,2)","v":0.05},null,"new",0.05,{"$f":"+W1","v":0},0.05,{"$f":"(AG1-AC1)/AG1","v":0},null,1,{"$f":"SUM(AJ1:AL1)+AE1","v":0.05},null,null,{"$f":"ROUND(AC1/(1-VLOOKUP(AF1,Group,2,FALSE)),2)","v":0.05},{"$f":"IF(VLOOKUP(AF1,Group,5,FALSE)=\"YES\",VLOOKUP(ROUND(ROUND(AJ1,1)-AJ1,2),Round,2,FALSE)+VLOOKUP(AF1,Group,6,FALSE),0)","v":0},{"$f":"IF(VLOOKUP(AF1,Group,7,FALSE)=\"\",0,ROUND(AJ1-0.04999,1)-AJ1+AM1)","v":0},{"$f":"IF(VLOOKUP(AF1,Group,7,FALSE)=\"\",\"\",VLOOKUP(AF1,Group,7,FALSE))","v":""},null,"X"]
[null,"Trim",null,null,"Size",null,"Shape",null,"Description",null,null,null,null,null,null,null,null,null,{"$f":"IF(Suggested=\"Yes\",'Price List'!AA2,'Price List'!AG2)","v":0.05},"EA",{"$f":"+Instructions!$B$3","v":"B"},null,{"$f":"+Instructions!$C$22","v":0},0.05,null,"new",0.05,0,0.05,0,null,2,0.05,null,null,0.05,0,0,"",null,"X"]
[null,"Decos",null,null,"Size",null,"Shape",null,"Description",null,null,null,null,null,null,null,null,null,{"$f":"IF(Suggested=\"Yes\",'Price List'!AA3,'Price List'!AG3)","v":0.05},"EA",{"$f":"+Instructions!$B$3","v":"B"},null,{"$f":"+Instructions!$C$22","v":0},0.05,null,"new",0.05,0,0.05,0,null,3,0.05,null,null,0.05,0,0,"",null,"X"]
[null,0,null,null,"Size",null,"Shape",null,"Description",null,null,null,null,null,null,null,null,null,{"$f":"IF(Suggested=\"Yes\",'Price List'!AA4,'Price List'!AG4)","v":0},"EA",{"$f":"+Instructions!$B$3","v":"B"},null,{"$f":"+Instructions!$C$22","v":0},0,null,"new",0,0,0,{"$error":"#DIV/0!"},null,4,0,null,null,0,0,0,"",null,"X"]
[null,0,null,null,"Size",null,"Shape",null,"Description",null,null,null,null,null,null,null,null,null,{"$f":"IF(Suggested=\"Yes\",'Price List'!AA5,'Price List'!AG5)","v":0},"EA",{"$f":"+Instructions!$B$3","v":"B"},null,{"$f":"+Instructions!$C$22","v":0},0,null,"new",0,0,0,{"$error":"#DIV/0!"},null,5,0,null,null,0,0,0,"",null,"X"]
[null,0,null,null,"Size",null,"Shape",null,"Description",null,null,null,null,null,null,null,null,null,{"$f":"IF(Suggested=\"Yes\",'Price List'!AA6,'Price List'!AG6)","v":0},"EA",{"$f":"+Instructions!$B$3","v":"B"},null,{"$f":"+Instructions!$C$22","v":0},0,null,"new",0,0,0,{"$error":"#DIV/0!"},null,6,0,null,null,0,0,0,"",null,"X"]
[null,0,null,null,"Size",null,"Shape",null,"Description",null," ",null,null,null,null,null,null,null,{"$f":"IF(Suggested=\"Yes\",'Price List'!AA7,'Price List'!AG7)","v":0},"EA",{"$f":"+Instructions!$B$3","v":"B"},null,{"$f":"+Instructions!$C$22","v":0},0,null,"new",0,0,0,{"$error":"#DIV/0!"},null,7,0,null,null,0,0,0,"",null,"X"]
[null,"Format",null,null,null,null,null,null,null,null,null,null,null,null,null,null,"Stock","a",1000,"ABC",null,null,0.1,1000,null,"ABC",1000,0.1,1000,0.1,10,null,1000,null,null,null,null,null,null,null,"X"]
[null,null,null,null,null,null,null,null,null,null,null,null,null,null,null,null,null,null,null,null,null,null,null,null,null,null,null,null,null,null,null,null,null,null,null,null,null,null,null,null,"X"]
[null,null,null,null,null,null,null,null,null,null,null,null,null,null,"Price List",null,null,null,null,null,null,null,"Cust. Cost",null,null,"Customer Cost Calculation",null,null,null,null,null,null,null,null,null,null,null,null,null,null,"X"]
[null,null,null,"Sizes & Shapes",null,null,null,null,null,null,null,null,null,null,"Full Carton",null,"Stock","Note",{"$f":"IF(Suggested=\"Yes\",AA11,AG11)","v":"List Price"},"U/M","Code",null,"Disc.","Net",null,"Chg","List Price","Disc","Act. Cost","GP%","Adj.","Group","Price",null,null,"Calc Price",".05 Round","Cents","Round to",null,"X"]
[null,null,null,null,null,null,null,null,null,null,null,null,null,null,null,null,null,null,null,null,null,null,null,null,null,null,null,null,null,null,null,null,null,null,null,null,null,null,null,null,"X"]
[null,null,null,null,null,null,null,null,null,null,null,null,null,null,{"$f":"\"File '\"&Instructions!B2&\"' - \"&Instructions!B1","v":"File 'N' - Novabell"},null,null,null,null,null,null,null,"Cost",null,null,null,null,null,null,null,null,null,"Retail Price Calculations",null,null,null,null,null,null,null,"X"]
[null,null,null,null,null,null,null,null,null,null,null,null,null,null,null,null,null,null,null,{"$f":"+Instructions!B4","v":"11/1/24 (Updated)"},null,null,null,null,null,null,null,null,null,null,{"$f":"TODAY()","v":"2024-11-04"},null,null,null,null,null,null,null,null,null,"X"]
[null,null,null,null,null,null,null,null,null,null,null,null,null,{"$f":"IF(Instructions!C8=\"\",\"\",+Instructions!C8)","v":""},null,null,null,null,null,null,null,null,null,null,null,null,null,null,null,null,null,null,null,null,null,null,null,null,null,null,"X"]
[null,null,{"$f":"\"Product Code '\"&Instructions!B3&\"'\"","v":"Product Code 'B'"},null,null,null,null,null,null,null,null,null,null,null,null,null,null,null,null,null,null,null,null,null,null,null,null,null,null,null,null,null,{"$f":"IF(Instructions!$C$8=\"\",\"\",Instructions!$C$8)","v":""},null,null,null,null,null,null,null,"X"]
[null,null,null,null,null,null,null,null,null,null,null,null,null,null,null,null,null,null,null,null,null,null,null,null,null,null,null,null,null,null,null,null,null,null,null,null,null,null,null,null,"X"]
[null,null,"Sizes & Shapes",null,null,null,null,null,null,null,null,null,null,null,"Full Carton",null,"Stock","Note",{"$f":"+S$11","v":"List Price"},"U/M",{"$f":"+U$11","v":"Code"},null,"Disc.","Net",null,"Chg","List Price",{"$f":"+AB$11","v":"Disc"},"Act. Cost","GP%","Adj.",{"$f":"+AF$11","v":"Group"},"Price",null,null,"Calc Price",".05 Round","Cents","Round to",null,"X"]
[null,null,"ALL ITEMS MARKED WITH PACKAGING QUANTITY ARE SOLD IN MULTIPLES OF THAT QUANTITY ONLY",null,null,null,null,null,null,null,null,null,null,null,null,null,null,null,null,null,null,null,null,null,null,null,null,null,null,null,null,null,null,null,null,null,null,null,null,null,"X"]
[null,null,"NON-Stock ITEMS - MINIMUM 6-8 WEEK DELIVERY"]
[null,null,null,null,null,null,null,null,null,null,null,null," ",null,null,null,null,null,null,null,null,null,null,null,null,null,null,null,null,null,null,null,null,null,null,null,null,null,null,null,"X"]
[null,null,"ASPEN - Glazed Porcelain",null,null,null,null,null,null," "," "," ","  "," "," ",null,null,"Item # Lookup:","NVAS"]
[null,null,null,null,null,null,null,null,null,null,null,null,null,null,null,null,null,null,null,null,null,null,null,null,null,null,null,null,null,null,null,null,null,null,null,null,null,null,null,null,"X"]
[null,null,null,"Colors:","Basalt          Oxide          Rock Grey          Sand Moon          Snow"]
[null,null,null,null,null,null,null,null,null,null,null,null,null,null,null,null,null,null,null,null,null,null,null,null,null,null,null,null,null,null,null,null,null,null,null,null,null,null,null,null,"X"]
[null,"Field Tile",null,null,"4\" x 12\"",null,"Field",null,null,null,null,null,null,null,null,"9.04 SF/CTN","Stock",null,{"$f":"IF(Suggested=\"Yes\",'Price List'!AA26,'Price List'!AG26)","v":8.8000000000000007},"SF",{"$f":"+Instructions!$B$3","v":"B"},null,{"$f":"+Instructions!$C$22","v":0},{"$f":"ROUND($AA26*(1-W26)+0.004999,2)","v":8.8000000000000007},null,"",8.8000000000000007,{"$f":"+W26","v":0},8.8000000000000007,{"$f":"(AG26-AC26)/AG26","v":0},null,1,{"$f":"SUM(AJ26:AL26)+AE26","v":8.8000000000000007},null,null,{"$f":"ROUND(AC26/(1-VLOOKUP(AF26,Group,2,FALSE)),2)","v":8.8000000000000007},{"$f":"IF(VLOOKUP(AF26,Group,5,FALSE)=\"YES\",VLOOKUP(ROUND(ROUND(AJ26,1)-AJ26,2),Round,2,FALSE)+VLOOKUP(AF26,Group,6,FALSE),0)","v":0},{"$f":"IF(VLOOKUP(AF26,Group,7,FALSE)=\"\",0,ROUND(AJ26-0.04999,1)-AJ26+AM26)","v":0},{"$f":"IF(VLOOKUP(AF26,Group,7,FALSE)=\"\",\"\",VLOOKUP(AF26,Group,7,FALSE))","v":""},null,"X"]
[null,"Field Tile",null,null,"12\" x 24\"",null,"Field",null,null,null,null," ",null,null,null,"13.56 SF/CTN","Stock",null,{"$f":"IF(Suggested=\"Yes\",'Price List'!AA27,'Price List'!AG27)","v":6.95},"SF",{"$f":"+Instructions!$B$3","v":"B"},null,{"$f":"+Instructions!$C$22","v":0},6.95,null,"",6.95,0,6.95,0,null,1,6.95,null,null,6.95,0,0,"",null,"X"]
[null,"Field Tile",null,null,"12\" x 24\"",null,"Field - Provenzale",null,null,null,null,null,null,null,null,"9.17 SF/CTN","Stock","a",{"$f":"IF(Suggested=\"Yes\",'Price List'!AA28,'Price List'!AG28)","v":14.65},"SF",{"$f":"+Instructions!$B$3","v":"B"},null,{"$f":"+Instructions!$C$22","v":0},14.65,null,"",14.65,0,14.65,0,null,1,14.65,null,null,14.65,0,0,"",null,"X"]
[null,"Field Tile",null,null,"12\" x 24\"",null,"Field - Struttura Grooves",null,null,null,null,null,null,null,null,"13.56 SF/CTN",null,null,{"$f":"IF(Suggested=\"Yes\",'Price List'!AA29,'Price List'!AG29)","v":7.2},"SF",{"$f":"+Instructions!$B$3","v":"B"},null,{"$f":"+Instructions!$C$22","v":0},7.2,null,"",7.2,0,7.2,0,null,1,7.2,null,null,7.2,0,0,"",null,"X"]
[null,"Field Tile",null,null,"24\" x 24\"",null,"Field",null,null,null,null,null,null,null,null,"11.62 SF/CTN",null,null,{"$f":"IF(Suggested=\"Yes\",'Price List'!AA30,'Price List'!AG30)","v":7.4},"SF",{"$f":"+Instructions!$B$3","v":"B"},null,{"$f":"+Instructions!$C$22","v":0},7.4,null,"",7.4,0,7.4,0,null,1,7.4,null,null,7.4,0,0,"",null,"X"]
[null,"Field Tile",null,null,"24\" x 48\"",null,"Field",null,null,null,null,null,null,null,null,"15.49 SF/CTN",null,null,{"$f":"IF(Suggested=\"Yes\",'Price List'!AA31,'Price List'!AG31)","v":7.55},"SF",{"$f":"+Instructions!$B$3","v":"B"},null,{"$f":"+Instructions!$C$22","v":0},7.55,null,"",7.55,0,7.55,0,null,1,7.55,null,null,7.55,0,0,"",null,"X"]
[null,"Field Tile",null,null,"24\" x 48\"",null,"Field - Struttura Grooves",null,null,null,null,null,null,null,null,"7.75 SF/CTN",null,null,{"$f":"IF(Suggested=\"Yes\",'Price List'!AA32,'Price List'!AG32)","v":7.85},"SF",{"$f":"+Instructions!$B$3","v":"B"},null,{"$f":"+Instructions!$C$22","v":0},7.85,null,"",7.85,0,7.85,0,null,1,7.85,null,null,7.85,0,0,"",null,"X"]
[null,null,null,null,null,null,null,null,null,null,null,null,null,null,null,null,null,null,null,null,null,null,null,null,null,null,null,null,null,null,null,null,null,null,null,null,null,null,null,null,"X"]
[null,"Decos",null,null,"12\" x 12\"",null,"Mosaic",null,"2\" x 2\"",null,null,null,null,"mesh-mounted",null,"0.97 SF/Sheet","Stock",null,{"$f":"IF(Suggested=\"Yes\",'Price List'!AA34,'Price List'!AG34)","v":18.7},"SF",{"$f":"+Instructions!$B$3","v":"B"},null,{"$f":"+Instructions!$C$22","v":0},{"$f":"ROUND($AA34*(1-W34)+0.004999,2)","v":18.7},null,"",18.7,{"$f":"+W34","v":0},18.7,{"$f":"(AG34-AC34)/AG34","v":0},null,3,{"$f":"SUM(AJ34:AL34)+AE34","v":18.7},null,null,{"$f":"ROUND(AC34/(1-VLOOKUP(AF34,Group,2,FALSE)),2)","v":18.7},{"$f":"IF(VLOOKUP(AF34,Group,5,FALSE)=\"YES\",VLOOKUP(ROUND(ROUND(AJ34,1)-AJ34,2),Round,2,FALSE)+VLOOKUP(AF34,Group,6,FALSE),0)","v":0},{"$f":"IF(VLOOKUP(AF34,Group,7,FALSE)=\"\",0,ROUND(AJ34-0.04999,1)-AJ34+AM34)","v":0},{"$f":"IF(VLOOKUP(AF34,Group,7,FALSE)=\"\",\"\",VLOOKUP(AF34,Group,7,FALSE))","v":""},null,"X"]
[null,"Decos",null,null,"12\" x 12\"",null,"Mosaic",null,"Pebble (Sassi)",null,null,null,null,"mesh-mounted",null,"9.68 SF/CTN",null,null,{"$f":"IF(Suggested=\"Yes\",'Price List'!AA35,'Price List'!AG35)","v":42},"SF",{"$f":"+Instructions!$B$3","v":"B"},null,{"$f":"+Instructions!$C$22","v":0},{"$f":"ROUND($AA35*(1-W35)+0.004999,2)","v":42},null,"",42,0,42,{"$f":"(AG35-AC35)/AG35","v":0},null,3,{"$f":"SUM(AJ35:AL35)+AE35","v":42},null,null,{"$f":"ROUND(AC35/(1-VLOOKUP(AF35,Group,2,FALSE)),2)","v":42},{"$f":"IF(VLOOKUP(AF35,Group,5,FALSE)=\"YES\",VLOOKUP(ROUND(ROUND(AJ35,1)-AJ35,2),Round,2,FALSE)+VLOOKUP(AF35,Group,6,FALSE),0)","v":0},{"$f":"IF(VLOOKUP(AF35,Group,7,FALSE)=\"\",0,ROUND(AJ35-0.04999,1)-AJ35+AM35)","v":0},{"$f":"IF(VLOOKUP(AF35,Group,7,FALSE)=\"\",\"\",VLOOKUP(AF35,Group,7,FALSE))","v":""},null,"X"]
[null,"Decos",null,null,"12\" x 12\"",null,"Mosaic",null,"Pebble (Sassi) - Dark Mix (O-B-RG)",null,null,null,null,"mesh-mounted",null,"9.68 SF/CTN",null,null,{"$f":"IF(Suggested=\"Yes\",'Price List'!AA36,'Price List'!AG36)","v":42},"SF",{"$f":"+Instructions!$B$3","v":"B"},null,{"$f":"+Instructions!$C$22","v":0},{"$f":"ROUND($AA36*(1-W36)+0.004999,2)","v":42},null,"",42,0,42,{"$f":"(AG36-AC36)/AG36","v":0},null,3,{"$f":"SUM(AJ36:AL36)+AE36","v":42},null,null,{"$f":"ROUND(AC36/(1-VLOOKUP(AF36,Group,2,FALSE)),2)","v":42},{"$f":"IF(VLOOKUP(AF36,Group,5,FALSE)=\"YES\",VLOOKUP(ROUND(ROUND(AJ36,1)-AJ36,2),Round,2,FALSE)+VLOOKUP(AF36,Group,6,FALSE),0)","v":0},{"$f":"IF(VLOOKUP(AF36,Group,7,FALSE)=\"\",0,ROUND(AJ36-0.04999,1)-AJ36+AM36)","v":0},{"$f":"IF(VLOOKUP(AF36,Group,7,FALSE)=\"\",\"\",VLOOKUP(AF36,Group,7,FALSE))","v":""},null,"X"]
[null,"Decos",null,null,"12\" x 12\"",null,"Mosaic",null,"Pebble (Sassi) - Light Mix (SM-S-RG)",null,null,null,null,"mesh-mounted",null,"9.68 SF/CTN",null,null,{"$f":"IF(Suggested=\"Yes\",'Price List'!AA37,'Price List'!AG37)","v":42},"SF",{"$f":"+Instructions!$B$3","v":"B"},null,{"$f":"+Instructions!$C$22","v":0},{"$f":"ROUND($AA37*(1-W37)+0.004999,2)","v":42},null,"",42,0,42,{"$f":"(AG37-AC37)/AG37","v":0},null,3,{"$f":"SUM(AJ37:AL37)+AE37","v":42},null,null,{"$f":"ROUND(AC37/(1-VLOOKUP(AF37,Group,2,FALSE)),2)","v":42},{"$f":"IF(VLOOKUP(AF37,Group,5,FALSE)=\"YES\",VLOOKUP(ROUND(ROUND(AJ37,1)-AJ37,2),Round,2,FALSE)+VLOOKUP(AF37,Group,6,FALSE),0)","v":0},{"$f":"IF(VLOOKUP(AF37,Group,7,FALSE)=\"\",0,ROUND(AJ37-0.04999,1)-AJ37+AM37)","v":0},{"$f":"IF(VLOOKUP(AF37,Group,7,FALSE)=\"\",\"\",VLOOKUP(AF37,Group,7,FALSE))","v":""},null,"X"]
[null,"Decos",null,null,"12\" x 24\"",null,"Mosaic",null,"Brick (Mattoncino)",null,null,null,null,"mesh-mounted",null,"7.75 SF/CTN",null,null,{"$f":"IF(Suggested=\"Yes\",'Price List'!AA38,'Price List'!AG38)","v":26.3},"SF",{"$f":"+Instructions!$B$3","v":"B"},null,{"$f":"+Instructions!$C$22","v":0},{"$f":"ROUND($AA38*(1-W38)+0.004999,2)","v":26.3},null,"",26.3,0,26.3,{"$f":"(AG38-AC38)/AG38","v":0},null,3,{"$f":"SUM(AJ38:AL38)+AE38","v":26.3},null,null,{"$f":"ROUND(AC38/(1-VLOOKUP(AF38,Group,2,FALSE)),2)","v":26.3},{"$f":"IF(VLOOKUP(AF38,Group,5,FALSE)=\"YES\",VLOOKUP(ROUND(ROUND(AJ38,1)-AJ38,2),Round,2,FALSE)+VLOOKUP(AF38,Group,6,FALSE),0)","v":0},{"$f":"IF(VLOOKUP(AF38,Group,7,FALSE)=\"\",0,ROUND(AJ38-0.04999,1)-AJ38+AM38)","v":0},{"$f":"IF(VLOOKUP(AF38,Group,7,FALSE)=\"\",\"\",VLOOKUP(AF38,Group,7,FALSE))","v":""},null,"X"]
[null,null,null,null,null,null,null,null,null,null,null,null,null,null,null,null,null,null,null,null,null,null,null,null,null,null,null,null,null,null,null,null,null,null,null,null,null,null,null,null,"X"]
[null,"Trim",null,null,"3\" x 24\"",null,"Bullnose",null,null,null,null,null,null,null,null,null,"Stock",null,{"$f":"IF(Suggested=\"Yes\",'Price List'!AA40,'Price List'!AG40)","v":16.850000000000001},"EA",{"$f":"+Instructions!$B$3","v":"B"},null,{"$f":"+Instructions!$C$22","v":0},{"$f":"ROUND($AA40*(1-W40)+0.004999,2)","v":16.850000000000001},null,"",16.850000000000001,{"$f":"+W40","v":0},{"$f":"+X40","v":16.850000000000001},{"$f":"(AG40-AC40)/AG40","v":0},null,2,{"$f":"SUM(AJ40:AL40)+AE40","v":16.850000000000001},null,null,{"$f":"ROUND(AC40/(1-VLOOKUP(AF40,Group,2,FALSE)),2)","v":16.850000000000001},{"$f":"IF(VLOOKUP(AF40,Group,5,FALSE)=\"YES\",VLOOKUP(ROUND(ROUND(AJ40,1)-AJ40,2),Round,2,FALSE)+VLOOKUP(AF40,Group,6,FALSE),0)","v":0},{"$f":"IF(VLOOKUP(AF40,Group,7,FALSE)=\"\",0,ROUND(AJ40-0.04999,1)-AJ40+AM40)","v":0},{"$f":"IF(VLOOKUP(AF40,Group,7,FALSE)=\"\",\"\",VLOOKUP(AF40,Group,7,FALSE))","v":""},null,"X"]
{"$rows_left_out":156}
{"sheet":"Websites","index":3,"n_rows":14,"n_cols":2,"rows_kept":14,"cut":false,"hidden":false,"merged":[]}
["Easy Access Website links"]
[]
["ConestogaTile's Website","http://www.cctd.com/index.php"]
[]
["Manufacturer's Home Page","https://www.novabell.it/en/"]
[]
[]
["Product","Direct Website Link"]
["ASPEN","https://www.novabell.it/en/collections/20496/"]
["BRICKUP","https://www.novabell.it/en/collections/brickup/"]
["EXTRA","https://www.novabell.it/en/collections/extra/"]
["MICHELANGELO (DISC 10/23/24)","https://www.novabell.it/en/collections/imperial-michelangelo/"]
["SOVEREIGN","https://www.novabell.it/en/collections/sovereign/"]
["URBE"]

{"sheet":"Changes","index":4,"n_rows":33,"n_cols":4,"rows_kept":33,"cut":false,"hidden":false,"merged":[[0,2,1,2]]}
["Date",null,"Description"]
["Announced","Series"]
[]
["New Products"]
["2016-04-01","Imperial","Glazed Porcelain"]
["2017-03-06","Imperial","Added colors Calacatta Beige and Nero Imperiale."]
["2017-03-06","Materia","Glazed Porcelain"]
["2018-02-01","Deco","Glazed Porcelain"]
["2018-02-01","Sovereign","Glazed Porcelain"]
["2018-02-01","Venice","Glazed Porcelain - Named Imperial Venice on Novabell's Website"]
["2019-03-12","Michelangelo","Glazed Porcelain - Named Imperial Michelangelo on Novabell's Website"]
["2021-01-01","Aspen","Glazed Porcelain"]
["2021-01-01","Brickup","Glazed Porcelain - 3D Brick"]
["2024-02-01","Extra","Glazed Porcelain"]
["2024-09-01","Urbe","Glazed Porcelain"]
[]
[]
["Discontinued Products"]
["2018-11-26","Imperial","In the \"Silk\" finish only, all formats in colors Calacatta Beige, Cappuccino and Nero Imperiale. "]
["2019-08-27","Imperial","In the \"Silk\" finish only, all formats in colors Calacatta Beige and Cappuccino."]
["2019-10-28","Materia","12\" x 24\" & 24\" x 24\" Field Tile formats in colors Ghiaccio and Grigio only."]
["2020-12-04","Imperial","In the \"Silk\" finish only, all formats in colors Crema and Nero Imperiale."]
["2020-12-04","Materia","2-3/8\" x 10\" Field Tile format in colors Blue, Grigio and Mud only."]
["2021-11-24","Imperial","All formats in the \"Silk\" finish.  Colors Cappuccino, Grigio Imperiale and London Grey in all formats and finishes.  Cassettone mosaic in all colors. "]
["2022-08-22","Deco","Entire Series.  (Discontinued by CCTD) - Disc. by Novabell 12/31/24!"]
["2022-08-22","Venice","Entire Series.  (Discontinued by CCTD)"]
["2022-10-17","Imperial","Entire Series.  (Discontinued by Novabell)"]
["2023-09-15","Materia","Entire Series.  (Discontinued by CCTD)"]
["2024-09-05","Aspen","8\" x 48\" Field Tile format only in all colors."]
["2024-09-05","Sovereign","2\" x 4\" 3D and 3\" x 3\" 3D Mosaics only in all colors."]
["2024-10-23","Michelangelo","Entire Series.  (Discontinued by Novabell)"]
["2024-11-04","Extra","36\" x 36\" and 36\" x 72\" Field Tile formats only in all colors.","  (Discontinued by Novabell)"]
["2024-11-04","Sovereign","24\" x 48\" Field Tile format only in all colors.  Colors Antracite and Tabacco only in all formats.","  (Discontinued by Novabell)"]