{"text_format":"1","workbook":"xlsx","n_sheets":5,"sheets":["Instructions","Index","Price List","Websites","Changes"],"not_rendered":{"charts":0,"images":3,"macros":1,"external_links":0,"defined_names":18,"comments":0,"pivot_tables":0},"unopened":[],"bounds":{"document_bytes":16777216,"sheet_cells":100000,"rows_first":2000,"rows_last":500,"rows_between":2000,"halvings":0,"cell_chars":16384,"cell_head_chars":4096},"cells_cut":0,"cells_raw":0,"read":"whole","date_system":"1900"}

{"sheet":"Instructions","index":0,"n_rows":58,"n_cols":8,"rows_kept":58,"cut":false,"hidden":false,"merged":[[7,2,7,7],[36,3,36,4]]}
["Manufacturer","Bati Orient"]
["File as","B"]
["Product Code","A"]
["CCTD Effective Date","7/1/24"]
[]
[]
[]
["Enter your Company Name"]
[]
[null,"Click on \"Index\" to set the print area for the price list index"]
[null,"Then you can send it to print"]
[]
[]
[null,"Click on \"Suggested Price List\" to set the print area for Conestoga Tile's suggested price list."]
[null,"Then you can send it to print"]
[]
[]
[null,"Enter your discount codes if you want a personal net cost sheet."]
[]
[null,"Product"]
[null,"Code","Disc. %"]
[null,{"$f":"+B3","v":"A"}]
[]
[null,"Click on \"Your Cost\" to set the print area for your personal cost report."]
[null,"Then you can send it to print"]
[]
[]
["Discount: ","To help establish your price list, enter the gross profit percent for each type of product."]
[null,"If you want to use Conestoga Tile's list price, leave them blank."]
[]
["Round Nickel: ","If you always want your price to round to the nearest nickel, enter \"YES\"."]
[null,"If you enter \"NO\", it will NOT round to the nearest nickel."]
[]
["Ending Cents: ","If you always want your price to end with a certain cents, enter that cent value."]
[null,"If you leave it \"blank\" will NOT round to this cent value."]
[]
[null,"Group","GP Margin","GP Margin % for",null,"Round Nickel","add/subtract","Ending Cents"]
[null,1,null,"Field Tile",null,"No",0]
[null,2,null,"Trim",null,"No",0]
[null,3,null,"Decos",null,"No",0]
{"$rows_left_out":19}
{"sheet":"Index","index":1,"n_rows":51,"n_cols":16,"rows_kept":51,"cut":false,"hidden":false,"merged":[[5,0,5,10],[48,0,48,10],[50,0,50,10],[2,5,2,10],[3,4,3,7]]}
[]
[]
[null,null,null,null,null,{"$f":"\"File '\"&Instructions!B2&\"' - \"&Instructions!B1","v":"File 'B' - Bati Orient"}]
[]
[]
[{"$f":"\"Price List Index - \"&Instructions!B4","v":"Price List Index - 7/1/24"}]
[]
[]
[]
[]
["Page",null,"Series",null,"Product Type"]
[1,null,"Décor & Style",null,"ARNO01 - ECO24"]
[2,null,"Décor & Style",null,"ECO25 - GAMI63R/30"]
[3,null,"Décor & Style",null,"GAMI74 - MAGR88"]
[4,null,"Décor & Style",null,"MAGR89/30 - MAMI184"]
[5,null,"Décor & Style",null,"MAMI185 - PIMI29"]
[6,null,"Décor & Style",null,"PIMI30 - VEMI145"]
[7,null,"Décor & Style",null,"VEMI151 - VEVI02"]
[8,null,"Cement Tiles",null,"CIBE01 - CINO02"]
[9,null,"Cement Tiles",null,"CIMI22 - CIMI48"]
[]
[]
[]
[]
[]
[]
[]
[]
[]
[]
[]
[]
[null,null,null,null,null,null,null,null,null,null,null,null,null,null,null," "]
[]
[]
[]
[]
[]
[]
[]
{"$rows_left_out":12}
{"sheet":"Price List","index":2,"n_rows":617,"n_cols":41,"rows_kept":617,"cut":false,"hidden":false,"merged":[[13,30,13,32],[9,22,9,23],[9,25,9,32],[12,22,12,23],[606,3,606,4],[18,2,18,19],[17,14,17,15],[600,2,600,19],[12,14,12,19],[558,3,558,19],[566,3,566,19],[9,14,9,19],[602,2,602,19],[14,13,15,19],[10,14,10,15],[564,3,564,19],[560,3,560,19],[562,3,562,19]]}
[null,"Field Tile",null,null,"Size",null,"Field",null,null,null,null,null,null,null,null,"SF/CTN",null,null,{"$f":"IF(Suggested=\"Yes\",AA1,AG1)","v":0},"SF",{"$f":"+Instructions!$B$3","v":"A"},null,{"$f":"+Instructions!$C$22","v":0},{"$f":"ROUND($AA1*(1-W1)+0.004999,2)","v":0},null,"new",0,{"$f":"+W1","v":0},0,{"$f":"(AG1-AC1)/AG1","v":{"$error":"#DIV/0!"}},null,1,{"$f":"SUM(AJ1:AL1)+AE1","v":0},null,null,{"$f":"ROUND(AC1/(1-VLOOKUP(AF1,Group,2,FALSE)),2)","v":0},{"$f":"IF(VLOOKUP(AF1,Group,5,FALSE)=\"YES\",VLOOKUP(ROUND(ROUND(AJ1,1)-AJ1,2),Round,2,FALSE)+VLOOKUP(AF1,Group,6,FALSE),0)","v":0},{"$f":"IF(VLOOKUP(AF1,Group,7,FALSE)=\"\",0,ROUND(AJ1-0.04999,1)-AJ1+AM1)","v":0},{"$f":"IF(VLOOKUP(AF1,Group,7,FALSE)=\"\",\"\",VLOOKUP(AF1,Group,7,FALSE))","v":""},null,"X"]
[null,"Trim",null,null,"Size",null,"Shape",null,"Description",null,null,null,null,null,null,null,null,null,{"$f":"IF(Suggested=\"Yes\",AA2,AG2)","v":0},"EA",{"$f":"+Instructions!$B$3","v":"A"},null,{"$f":"+Instructions!$C$22","v":0},0,null,"new",0,0,0,{"$error":"#DIV/0!"},null,2,0,null,null,0,0,0,"",null,"X"]
[null,"Decos",null,null,"Size",null,"Shape",null,"Description",null,null,null,null,null,null,null,null,null,0.05,"EA",{"$f":"+Instructions!$B$3","v":"A"},null,{"$f":"+Instructions!$C$22","v":0},0.05,null,"new",0.05,0,0.05,0,null,3,0.05,null,null,0.05,0,0,"",null,"X"]
[null,0,null,null,"Size",null,"Shape",null,"Description",null,null,null,null,null,null,null,null,null,0,"EA",{"$f":"+Instructions!$B$3","v":"A"},null,{"$f":"+Instructions!$C$22","v":0},0,null,"new",0,0,0,{"$error":"#DIV/0!"},null,4,0,null,null,0,0,0,"",null,"X"]
[null,0,null,null,"Size",null,"Shape",null,"Description",null,null,null,null,null,null,null,null,null,0,"EA",{"$f":"+Instructions!$B$3","v":"A"},null,{"$f":"+Instructions!$C$22","v":0},0,null,"new",0,0,0,{"$error":"#DIV/0!"},null,5,0,null,null,0,0,0,"",null,"X"]
[null,0,null,null,"Size",null,"Shape",null,"Description",null,null,null,null,null,null,null,null,null,0,"EA",{"$f":"+Instructions!$B$3","v":"A"},null,{"$f":"+Instructions!$C$22","v":0},0,null,"new",0,0,0,{"$error":"#DIV/0!"},null,6,0,null,null,0,0,0,"",null,"X"]
[null,0,null,null,"Size",null,"Shape",null,"Description",null,null,null,null,null,null,null,null,null,0,"EA",{"$f":"+Instructions!$B$3","v":"A"},null,{"$f":"+Instructions!$C$22","v":0},0,null,"new",0,0,0,{"$error":"#DIV/0!"},null,7,0,null,null,0,0,0,"",null,"X"]
[null,"Format",null,null,null,null,null,null,null,null,null,null,null,null,null,null,"Stock","a",1000,"ABC",null,null,0.1,1000,null,"ABC",1000,0.1,1000,0.1,10,null,1000,null,null,null,null,null,null,null,"X"]
[null,null,null,null,null,null,null,null,null,null,null,null,null,null,null,null,null,null,null,null,null,null,null,null,null,null,null,null,null,null,null,null,null,null,null,null,null,null,null,null,"X"]
[null,null,null,null,null,null,null,null,null,null,null,null,null,null,"Price List",null,null,null,null,null,null,null,"Cust. Cost",null,null,"Customer Cost Calculation",null,null,null,null,null,null,null,null,null,null,null,null,null,null,"X"]
[null,null,null,"Sizes & Shapes",null,null,null,null,null,null,null,null,null,null,"Full Carton",null,"Stock","Note",{"$f":"IF(Suggested=\"Yes\",AA11,AG11)","v":"List Price"},"U/M","Code",null,"Disc.","Net",null,"Chg","List Price","Disc","Act. Cost","GP%","Adj.","Group","Price",null,null,"Calc Price",".05 Round","Cents","Round to",null,"X"]
[null,null,null,null,null,null,null,null,null,null,null,null,null,null,null,null,null,null,null,null,null,null,null,null,null,null,null,null,null,null,null,null,null,null,null,null,null,null,null,null,"X"]
[null,null,null,null,null,null,null,null,null,null,null,null,null,null,{"$f":"\"File '\"&Instructions!B2&\"' - \"&Instructions!B1","v":"File 'B' - Bati Orient"},null,null,null,null,null,null,null,"Cost",null,null,null,null,null,null,null,null,null,"Retail Price Calculations",null,null,null,null,null,null,null,"X"]
[null,null,null,null,null,null,null,null,null,null,null,null,null,null,null,null,null,null,null,{"$f":"+Instructions!B4","v":"7/1/24"},null,null,null,null,null,null,null,null,null,null,{"$f":"TODAY()","v":"2024-05-29"},null,null,null,null,null,null,null,null,null,"X"]
[null,null,null,null,null,null,null,null,null,null,null,null,null,{"$f":"IF(Instructions!C8=\"\",\"\",+Instructions!C8)","v":""},null,null,null,null,null,null,null,null,null,null,null,null,null,null,null,null,null,null,null,null,null,null,null,null,null,null,"X"]
[null,null,{"$f":"\"Product Code '\"&Instructions!B3&\"'\"","v":"Product Code 'A'"},null,null,null,null,null,null,null,null,null,null,null,null,null,null,null,null,null,null,null,null,null,null,null,null,null,null,null,null,null,{"$f":"IF(Instructions!$C$8=\"\",\"\",Instructions!$C$8)","v":""},null,null,null,null,null,null,null,"X"]
[null,null,null,null,null,null,null,null,null,null,null,null,null,null,null,null,null,null,null,null,null,null,null,null,null,null,null,null,null,null,null,null,null,null,null,null,null,null,null,null,"X"]
[null,null,"Sizes & Shapes",null,null,null,null,null,null,null,null,null,null,null,"Full Carton",null,"Stock","Note",{"$f":"+S$11","v":"List Price"},"U/M",{"$f":"+U$11","v":"Code"},null,"Disc.","Net",null,"Chg","List Price",{"$f":"+AB$11","v":"Disc"},"Act. Cost","GP%","Adj.",{"$f":"+AF$11","v":"Group"},"Price",null,null,"Calc Price",".05 Round","Cents","Round to",null,"X"]
[null,null,"ALL ITEMS MARKED WITH PACKAGING QUANTITY ARE SOLD IN MULTIPLES OF THAT QUANTITY ONLY",null,null,null,null,null,null,null,null,null,null,null,null,null,null,null,null,null,null,null,null,null,null,null,null,null,null,null,null,null,null,null,null,null,null,null,null,null,"X"]
[null,null,null,null,null,null,null,null,null,null,null,null," ",null,null,null,null,null,null,null,null,null,null,null,null,null,null,null,null,null,null,null,null,null,null,null,null,null,null,null,"X"]
[null,null,"DÉCOR & STYLE",null,null,null,null,null,null,null,null," ","  "," "," ",null,null,"Item # Lookup:","BO"]
[null,null,null,null,null,null,null,null,null,null,null,null,null,null," ",null,null,null,null,null,null,null,null,null,null,null,null,null,null,null,null,null,null,null,null,null,null,null,null,null,"X"]
[9.75,"Decos",null,null,"12\" x 12\"",null,"Mosaic",null,null,"ARNO01",null,"Black Slate 1\" x 1\"",null,null," "," ",null,null,{"$f":"IF(Suggested=\"Yes\",AA23,AG23)","v":49.35},"EA",{"$f":"+Instructions!$B$3","v":"A"},null,{"$f":"+Instructions!$C$22","v":0},{"$f":"ROUND($AA23*(1-W23)+0.004999,2)","v":49.35},null,"YES",49.35,{"$f":"+W23","v":0},49.35,{"$f":"(AG23-AC23)/AG23","v":0},null,3,{"$f":"SUM(AJ23:AL23)+AE23","v":49.35},null,null,{"$f":"ROUND(AC23/(1-VLOOKUP(AF23,Group,2,FALSE)),2)","v":49.35},{"$f":"IF(VLOOKUP(AF23,Group,5,FALSE)=\"YES\",VLOOKUP(ROUND(ROUND(AJ23,1)-AJ23,2),Round,2,FALSE)+VLOOKUP(AF23,Group,6,FALSE),0)","v":0},{"$f":"IF(VLOOKUP(AF23,Group,7,FALSE)=\"\",0,ROUND(AJ23-0.04999,1)-AJ23+AM23)","v":0},{"$f":"IF(VLOOKUP(AF23,Group,7,FALSE)=\"\",\"\",VLOOKUP(AF23,Group,7,FALSE))","v":""},null,"X"]
[null,"Decos",null,null,"12\" x 12\"",null,"Mosaic",null,null,"ARNO02",null,"Black Slate 3/4\" x 1-5/8\" Brick",null,null,null,null,null,null,49.35,"EA",{"$f":"+Instructions!$B$3","v":"A"},null,{"$f":"+Instructions!$C$22","v":0},49.35,null,"YES",49.35,0,49.35,0,null,3,49.35,null,null,49.35,0,0,"",null,"X"]
[null,"Decos",null,null,"4-3/4\" x 12\"",null,"Border",null,null,"ARNO03",null,"Black Slate",null,null," ",null,null,null,31.5,"EA",{"$f":"+Instructions!$B$3","v":"A"},null,{"$f":"+Instructions!$C$22","v":0},31.5,null,"",31.5,0,31.5,0,null,3,31.5,null,null,31.5,0,0,"",null,"X"]
[null,"Decos",null,null,"6\" x 12\" x 1/2\"",null,"Mosaic",null,null,"ARNO14",null,"Grey Wall Slate",null,null,null,null,null,null,25.2,"EA",{"$f":"+Instructions!$B$3","v":"A"},null,{"$f":"+Instructions!$C$22","v":0},25.2,null,"YES",25.2,0,25.2,0,null,3,25.2,null,null,25.2,0,0,"",null,"X"]
[null,"Decos",null,null,"4\" x 14\"",null,"Wall Cladding",null,null,"ARNO20",null,"Black Slate",null,null,null,"12 PCS/CTN",null,null,18.95,"EA",{"$f":"+Instructions!$B$3","v":"A"},null,{"$f":"+Instructions!$C$22","v":0},18.95,null,"YES",18.95,{"$f":"+W27","v":0},18.95,0,null,3,18.95,null,null,18.95,0,0,"",null,"X"]
[null,"Decos",null,null,"12\" x 12\"",null,"Mosaic",null,null,"ARNO22",null,"Black Slate Baguette Squares",null,null,null,null,null,null,34.950000000000003,"EA",{"$f":"+Instructions!$B$3","v":"A"},null,{"$f":"+Instructions!$C$22","v":0},34.950000000000003,null,"YES",34.950000000000003,0,34.950000000000003,0,null,3,34.950000000000003,null,null,34.950000000000003,0,0,"",null,"X"]
[null,"Decos",null,null,"12\" x 12\"",null,"Mosaic",null,null,"ARRO01",null,"Rust Slate 1\" x 1\"",null,null,null,null,null,null,53.85,"EA",{"$f":"+Instructions!$B$3","v":"A"},null,{"$f":"+Instructions!$C$22","v":0},53.85,null,"YES",53.85,{"$f":"+W29","v":0},53.85,0,null,3,53.85,null,null,53.85,0,0,"",null,"X"]
[null,"Decos",null,null,"12\" x 12\"",null,"Mosaic",null,null,"ARRO02",null,"Rust Slate 3/4\" x 1-5/8\"",null,null,null,null,null,null,53.85,"EA",{"$f":"+Instructions!$B$3","v":"A"},null,{"$f":"+Instructions!$C$22","v":0},53.85,null,"YES",53.85,0,53.85,0,null,3,53.85,null,null,53.85,0,0,"",null,"X"]
[null,"Decos"," ",null,"4-3/4\" x 12\"",null,"Border",null,null,"ARRO03",null,"Rust Slate",null,null,null,null,null,null,31.95,"EA",{"$f":"+Instructions!$B$3","v":"A"},null,{"$f":"+Instructions!$C$22","v":0},31.95,null,"YES",31.95,0,31.95,0,null,3,31.95,null,null,31.95,0,0,"",null,"X"]
[null,"Decos",null,null,"12\" x 11.6\"",null,"Mosaic",null,null,"ARRO16",null,"Beige/Brown Slate/Glass Baguette",null,null,null,null,null,null,83.45,"EA",{"$f":"+Instructions!$B$3","v":"A"},null,{"$f":"+Instructions!$C$22","v":0},83.45,null,"",83.45,0,83.45,0,null,3,83.45,null,null,83.45,0,0,"",null,"X"]
[null,"Decos",null,null,"12\" x 12\"",null,"Mosaic",null,null,"ARRO17",null,"Brown Slate/Beige Brown Glass Glossy 5/8\" x 5/8\"",null,null,null,null,null,"a",83.4,"EA",{"$f":"+Instructions!$B$3","v":"A"},null,{"$f":"+Instructions!$C$22","v":0},83.4,null,"",83.4,0,83.4,0,null,3,83.4,null,null,83.4,0,0,"",null,"X"]
[null,"Decos",null,null,"4\" x 14\"",null,"Wall Cladding",null,null,"ARRO19",null,"Rust Slate",null,null,null,"12 PCS/CTN",null,null,20,"EA",{"$f":"+Instructions!$B$3","v":"A"},null,{"$f":"+Instructions!$C$22","v":0},20,null,"",20,{"$f":"+W34","v":0},20,0,null,3,20,null,null,20,0,0,"",null,"X"]
[null,"Decos",null,null,"12.6\" x 12.6\"",null,"Mosaic",null,null,"BOBO08",null,"Fossil Wood Stone Beige Brown Mix",null,null,null,null,null,null,57.7,"EA",{"$f":"+Instructions!$B$3","v":"A"},null,{"$f":"+Instructions!$C$22","v":0},57.7,null,"",57.7,0,57.7,0,null,3,57.7,null,null,57.7,0,0,"",null,"X"]
[null,"Decos",null,null,"13\" x 11.8\"",null,"Mosaic",null,null,"BOBO09",null,"Fossil Wood Stone Beige Brown Mix Baguette",null,null,null,null,null,null,66.599999999999994,"EA",{"$f":"+Instructions!$B$3","v":"A"},null,{"$f":"+Instructions!$C$22","v":0},66.599999999999994,null,"YES",66.599999999999994,0,66.599999999999994,0,null,3,66.599999999999994,null,null,66.599999999999994,0,0,"",null,"X"]
[null,"Decos",null,null,"12\" x 12\" x 0.4\"",null,"Mosaic",null,null,"BOCA01",null,"Coffee Tree Logs Wood Log Sliced Round",null,null,null,null,null,"b",50.6,"EA",{"$f":"+Instructions!$B$3","v":"A"},null,{"$f":"+Instructions!$C$22","v":0},50.6,null,"YES",50.6,{"$f":"+W37","v":0},50.6,0,null,3,50.6,null,null,50.6,0,0,"",null,"X"]
[null,"Decos",null,null,"11.8\" x 11.8\"",null,"Mosaic",null,null,"BOFO01",null,"Cubic Fossil Wood Stone",null,null,null,null,null,null,72.05,"EA",{"$f":"+Instructions!$B$3","v":"A"},null,{"$f":"+Instructions!$C$22","v":0},72.05,null,"YES",72.05,0,72.05,0,null,3,72.05,null,null,72.05,0,0,"",null,"X"]
[null,"Decos",null,null,"13\" x 14.4\"",null,"Mosaic",null,null,"BOMA01",null,"Natural Wood",null,null,null,null,null,"c",44,"EA",{"$f":"+Instructions!$B$3","v":"A"},null,{"$f":"+Instructions!$C$22","v":0},44,null,"YES",44,0,44,0,null,3,44,null,null,44,0,0,"",null,"X"]
[null,"Decos",null,null,"21\" x 8\"",null,"Mosaic",null,null,"BOMA04",null,"Natural Wood",null,null,null,null,null,"c",47.4,"EA",{"$f":"+Instructions!$B$3","v":"A"},null,{"$f":"+Instructions!$C$22","v":0},47.4,null,"",47.4,0,47.4,0,null,3,47.4,null,null,47.4,0,0,"",null,"X"]
{"$rows_left_out":578}
{"sheet":"Websites","index":3,"n_rows":8,"n_cols":2,"rows_kept":8,"cut":false,"hidden":false,"merged":[]}
["Easy Access Website links"]
[]
["ConestogaTile's Website","http://www.conestogatile.com/"]
[]
["Manufacturer's Home Page","https://www.batiorientusa.com/en/home"]
[]
[]
["Product","Direct Website Link"]

{"sheet":"Changes","index":4,"n_rows":564,"n_cols":15,"rows_kept":564,"cut":false,"hidden":false,"merged":[]}
["Date Announced","Series"]
[]
["New Products"]
[]
["2013-04-01","Decorative Mosaics"]
["2013-04-01","Marble"]
["2013-04-01","Pebbles"]
["2013-04-01","Quartzite / Slate"]
["2013-05-28","Decorative Mosaics"]
["2013-05-28","Marble"]
["2013-05-28","Marble"]
["2013-05-28","Pebbles"]
["2013-05-28","Quartzite / Slate"]
["2013-05-28","Quartzite / Slate"]
["2014-08-12","ARRO16 - Slate / Beige & Brown Glass 12\" x 11.6\" Mosaic"]
["      \"","ARRO17 - Slate / Beige & Brown Glass 12\" x 12\" Mosaic"]
["      \"","MABL75/30 - White 5-1/2\" x 12\" Border"]
["      \"","MACA02/30 - Cappuccino 5-1/2\" x 12\" Border"]
["      \"","MACA03 - Cappuccino 11.6\" x 12\" Mosaic"]
["      \"","MAGR89/30 - Grey 5-1/2\" x 12\" Border"]
["      \"","MAGR92 - Dark Grey 11.6\" x 12\" Mosaic"]
["      \"","MAMI92 - Marble / Beige & Brown Glass 12\" x 12\" Mosaic"]
["      \"","MAMI93 - Marble / Beige & Brown Glass 12\" x 12\" Mosaic"]
["      \"","MAMI94 - Marble / Black, Grey & White Glass 12\" x 12\" Mosaic"]
["      \"","MAMI95 - Marble / Black, Grey & White Glass 12\" x 12\" Mosaic"]
["      \"","MAMI96/30 - White / Grey / Dark Grey 5-1/2\" x 12\" Border"]
["      \"","MAMI101 - Black 12\" x 12\" Mosaic",null,null,null,null," "]
["      \"","MAMI102 - Black 4\" x 12\" Border"]
["      \"","MAMI103 - Beige 12\" x 12\" Mosaic"]
["      \"","MAMI104 - Beige 4\" x 12\" Border"]
["      \"","MAMI119 - Beige / Shell Brown 11.6\" x 12\" Mosaic"]
["      \"","MAMI120 - Beige / White / Shell Beige 11.6\" x 12\" Mosaic"]
["      \"","MAMI123 - Cappuccino / Onyx Cream 11.6\" x 12\" Mosaic"]
["      \"","PIMI19 - White / Grey / Silver 4\" x 12\" Border"]
["      \"","PIMI21 - Taupe / Gold 4\" x 12\" Border"]
["      \"","PIMI23 - White / Grey / Red 4\" x 12\" Border"]
["      \"","PIMI24 - Zebra 2\" x 2\" White / Black Décor 12\" x 12\" Mosaic"]
["      \"","QUMI17 - Grey / Beige Glass / Quartzite / Metal 12\" x 12\" Mosaic"]
["      \"","VEMI65 - Blue / Light Blue / White 3\" x 7.9\" Border "]
["      \"","VEMI66 - Black / Grey / White 3\" x 7.9\" Border  "]
{"$rows_left_out":524}